Benzoic acid, 2-methoxy-, ethyl ester
- Formula: C10H12O3
- Molecular weight: 180.2005
- IUPAC Standard InChIKey: FNODWEPAWIJGPM-UHFFFAOYSA-N
- CAS Registry Number: 7335-26-4
- Chemical structure:
View 3d structure (requires JavaScript / HTML 5) - Other names: o-Anisic acid, ethyl ester; Ethyl o-methoxybenzoate; Ethyl 2-methoxybenzoate; o-Methoxybenzoic acid, ethyl ester; ethyl o-anisate

Phase change data

Data compiled as indicated in comments:
TRC - Thermodynamics Research Center, NIST Boulder Laboratories, Chris Muzny director
BS - Robert L. Brown and Stephen E. Stein
Quantity | Value | Units | Method | Reference | Comment |
---|---|---|---|---|---|
Tboil | 534.65 | K | N/A | Perkin, 1896 | Uncertainty assigned by TRC = 1. K; TRC |
Reduced pressure boiling point
Tboil (K) | Pressure (bar) | Reference | Comment |
---|---|---|---|
408.2 | 0.016 | Weast and Grasselli, 1989 | BS |

Van Den Dool and Kratz RI, non-polar column, temperature ramp

Column type | Active phase | I | Reference | Comment |
---|---|---|---|---|
Capillary | VF-5MS | 1435. | Todua, 2011 | 30. m/0.25 mm/0.25 μm, He; Tstart: 60. C; Tend: 270. C |

Van Den Dool and Kratz RI, non-polar column, custom temperature program

Column type | Active phase | I | Reference | Comment |
---|---|---|---|---|
Capillary | 5 % Phenyl methyl siloxane | 1412.1 | Zaikin, 2003 | Column length: 30. m; Column diameter: 0.19 mm; Program: 50 C to 120 C at 5 C/min; 120 C to 290 C at 12 C/min |

References

Perkin, 1896
Perkin, W.H.,
LXIX. On Magnetic Rotatory Power, especially of Aromatic Compounds,
J. Chem. Soc., 1896, 69, 1025-1257. [all data]
Weast and Grasselli, 1989
CRC Handbook of Data on Organic Compounds, 2nd Editon, Weast,R.C and Grasselli, J.G., ed(s)., CRC Press, Inc., Boca Raton, FL, 1989, 1. [all data]
Todua, 2011
Todua, N.G.,
Retention Data. NIST Mass Spectrometry Data Center., NIST Mass Spectrometry Data Center, 2011. [all data]
Zaikin, 2003
Zaikin, V.G.,
Personal Communication: Retention indices measured during the period 2001 to 2003, 2003. [all data]