1-Cyclopentylpiperidine

Phase change data

Data compiled as indicated in comments:
TRC - Thermodynamics Research Center, NIST Boulder Laboratories, Chris Muzny director
AC - William E. Acree, Jr., James S. Chickos

Quantity Value Units Method Reference Comment
Tboil483.15KN/AJones, 1950Uncertainty assigned by TRC = 2. K; TRC
Quantity Value Units Method Reference Comment
Δvap55.1 ± 0.3kJ/molGSVerevkin, 1998Based on data from 283. - 318. K.; AC

Enthalpy of vaporization

ΔvapH (kJ/mol) Temperature (K) Method Reference Comment
54.9 ± 0.3301.GSVerevkin, 1998Based on data from 283. - 318. K.; AC

In addition to the Thermodynamics Research Center (TRC) data available from this site, much more physical and chemical property data is available from the following TRC products:

Condensed phase thermochemistry data

Data compiled by: Hussein Y. Afeefy, Joel F. Liebman, and Stephen E. Stein

Quantity Value Units Method Reference Comment
Δfliquid-150.4kJ/molCcbProchazka, Krestanova, et al., 1970
Quantity Value Units Method Reference Comment
Δcliquid-6500.1 ± 2.6kJ/molCcbProchazka, Krestanova, et al., 1970

References

Jones, 1950
Jones, J.I., Coal tar bases. III. By-product of the hydrogenation of pyridine with Raney Nickel., J. Chem. Soc., 1950, 1950, 1392. [all data]

Verevkin, 1998
Verevkin, Sergey P., Structural Chemistry, 1998, 9, 2, 113-119, https://doi.org/10.1023/A:1022459803871 . [all data]