N-hexylpiperidine
- Formula: C11H23N
- Molecular weight: 169.3070
- IUPAC Standard InChIKey: BBYSGWAYRRMWOW-UHFFFAOYSA-N
- CAS Registry Number: 7335-01-5
- Chemical structure:
View 3d structure (requires JavaScript / HTML 5) - Species with the same structure:

Phase change data

Data compiled by: Thermodynamics Research Center, NIST Boulder Laboratories, Chris Muzny director
Quantity | Value | Units | Method | Reference | Comment |
---|---|---|---|---|---|
Tboil | 492.35 | K | N/A | Magnusson and Schierz, 1940 | Uncertainty assigned by TRC = 0.5 K |

References

Magnusson and Schierz, 1940
Magnusson, H.W.; Schierz, E.R.,
A Study of SOme Physical Constants of N-n-Alkylpiperidines,
Univ. Wyo. Publ., 1940, 7, 1. [all data]