2-Furanol, tetrahydro-2-methyl-
- Formula: C5H10O2
- Molecular weight: 102.1317
- IUPAC Standard InChIKey: WBESQMVRIKXRFL-UHFFFAOYSA-N
- CAS Registry Number: 7326-46-7
- Chemical structure:
View 3d structure (requires JavaScript / HTML 5) - Permanent link for this species. Use this link for bookmarking this species for future reference.

Reaction thermochemistry data

Data compiled by: Hussein Y. Afeefy, Joel F. Liebman, and Stephen E. Stein
Individual Reactions
By formula: C5H10O2 = C5H10O2
Quantity | Value | Units | Method | Reference | Comment |
---|---|---|---|---|---|
ΔrH° | 3. | kJ/mol | Eqk | Whiting and Edward, 1971 | liquid phase; solvent: Dioxane |

References

Whiting and Edward, 1971
Whiting, J.E.; Edward, J.T.,
Ring-chain tautomerism of hydroxy ketones,
Can. J. Chem., 1971, 49, 3799-38. [all data]