bis(pentylammonium) tetachlorozincate

Phase change data

Data compiled by: Thermodynamics Research Center, NIST Boulder Laboratories, Chris Muzny director

Quantity Value Units Method Reference Comment
Ttriple437.KN/ACuevas, Tello, et al., 1984Crystal phase 1 phase; Uncertainty assigned by TRC = 1. K

In addition to the Thermodynamics Research Center (TRC) data available from this site, much more physical and chemical property data is available from the following TRC products:

References

Cuevas, Tello, et al., 1984
Cuevas, A.G.; Tello, M.; Echarri, A.L., Phase transition sequence in (C5H11NH3)2ZnCl4 between 55 and 355 K, J. Phys. Chem. Solids, 1984, 45, 1175. [all data]