3,5-Dimethoxybenzaldehyde
- Formula: C9H10O3
- Molecular weight: 166.1739
- IUPAC Standard InChIKey: VFZRZRDOXPRTSC-UHFFFAOYSA-N
- CAS Registry Number: 7311-34-4
- Chemical structure:
View 3d structure (requires JavaScript / HTML 5) - Other names: Benzaldehyde, 3,5-dimethoxy-; Benzaldehyde, 3,5-dimiethoxy

Phase change data

Data compiled by: Robert L. Brown and Stephen E. Stein
Reduced pressure boiling point
Tboil (K) | Pressure (atm) | Reference |
---|---|---|
424.2 | 0.021 | Weast and Grasselli, 1989 |

References

Weast and Grasselli, 1989
CRC Handbook of Data on Organic Compounds, 2nd Editon, Weast,R.C and Grasselli, J.G., ed(s)., CRC Press, Inc., Boca Raton, FL, 1989, 1. [all data]