2,4-Hexanedione, 5,5-dimethyl-
- Formula: C8H14O2
- Molecular weight: 142.1956
- IUPAC Standard InChIKey: LCLCVVVHIPPHCG-UHFFFAOYSA-N
- CAS Registry Number: 7307-04-2
- Chemical structure:
View 3d structure (requires JavaScript / HTML 5) - Species with the same structure:
- Other names: Pivaloylacetone, keto form; 5,5-Dimethyl-hexan-2,4-dione; 5,5-Dimethylhexane-2,4-dione

Reaction thermochemistry data

Data compiled by: Hussein Y. Afeefy, Joel F. Liebman, and Stephen E. Stein
Individual Reactions
By formula: C8H14O2 = C8H14O2
Quantity | Value | Units | Method | Reference | Comment |
---|---|---|---|---|---|
ΔrH° | -16. ± 0.8 | kJ/mol | Eqk | Calmon, 1969 | liquid phase; NMR |

References

Calmon, 1969
Calmon, J.P.,
Thermodynamic functions of enolization of aliphatic β-diketones,
C. R. Acad. Sci. Paris, 1969, 268, 1435-1438. [all data]