5-Methylhexane-2,4-dione, keto form
- Formula: C7H12O2
- Molecular weight: 128.1690
- IUPAC Standard InChIKey: KHZGUWAFFHXZLC-UHFFFAOYSA-N
- CAS Registry Number: 7307-03-1
- Chemical structure:
View 3d structure (requires JavaScript / HTML 5) - Other names: 5-Methyl-2,4-hexanedione (enol); 5-Methyl-2,4-hexanedione

Gas phase thermochemistry data

Data compiled by: Hussein Y. Afeefy, Joel F. Liebman, and Stephen E. Stein
Quantity | Value | Units | Method | Reference | Comment |
---|---|---|---|---|---|
ΔfH°gas | -452.7 | kJ/mol | Ion | Conrath, Van de Sande, et al., 1974 | Mass spectrometery (enol) |

Reaction thermochemistry data

Data compiled by: Hussein Y. Afeefy, Joel F. Liebman, and Stephen E. Stein
Individual Reactions
By formula: C7H12O2 = C7H12O2
Quantity | Value | Units | Method | Reference | Comment |
---|---|---|---|---|---|
ΔrH° | -13. ± 0.8 | kJ/mol | Eqk | Calmon, 1969 | liquid phase; NMR |

Kovats' RI, non-polar column, isothermal

Column type | Active phase | Temperature (C) | I | Reference | Comment |
---|---|---|---|---|---|
Capillary | DB-5 | 130. | 940.17 | Mijin and Antonovic, 2004 | 60. m/0.321 mm/0.25 μm, N2 |
Capillary | DB-5 | 150. | 944.07 | Mijin and Antonovic, 2004 | 60. m/0.321 mm/0.25 μm, N2 |
Capillary | DB-5 | 170. | 945.33 | Mijin and Antonovic, 2004 | 60. m/0.321 mm/0.25 μm, N2 |
Capillary | DB-5 | 190. | 950.54 | Mijin and Antonovic, 2004 | 60. m/0.321 mm/0.25 μm, N2 |

References

Conrath, Van de Sande, et al., 1974
Conrath, k.; Van de Sande, C.; Vandewalle, M.,
Studies in organic mass spectrometry. XVI. A combined approach to the structures of ions generated from the molecular ions of acyclic β-diketones through loss of small neutral molecules,
Org. Mass Spectrom., 1974, 9, 585-593. [all data]
Calmon, 1969
Calmon, J.P.,
Thermodynamic functions of enolization of aliphatic β-diketones,
C. R. Acad. Sci. Paris, 1969, 268, 1435-1438. [all data]
Mijin and Antonovic, 2004
Mijin, D.Z.; Antonovic, D.G.,
Temperature dependence of the Kovats retention indices for alkyl 1,3-diketones on a DB-5 capillary column,
J. Serb. Chem. Soc., 2004, 69, 10, 759-767, https://doi.org/10.2298/JSC0410759M
. [all data]