adenosine 5'-(trihydrogen diphosphate), 5'→5'-ester with 3-carbamoyl-1-α-D-ribofuranosylpyridinium--ate

Condensed phase thermochemistry data

Data compiled by: Eugene S. Domalski and Elizabeth D. Hearing

Constant pressure heat capacity of solid

Cp,solid (J/mol*K) Temperature (K) Reference
773.298.Yang and Rupley, 1979

References

Yang and Rupley, 1979
Yang, P-H.; Rupley, J.A., Heat capacity of nicotinamide adenine dinucleotide in aqueous solution and in the crystal, J. Chem. Thermodynam., 1979, 11, 301-302. [all data]