p-Bromophenyl heptyl ketone
- Formula: C14H19BrO
- Molecular weight: 283.204
- IUPAC Standard InChIKey: QMCHXDWPJPADAK-UHFFFAOYSA-N
- CAS Registry Number: 7295-48-9
- Chemical structure:
View 3d structure (requires JavaScript / HTML 5) - Other names: p-Octanoylbromobenzene

Phase change data

Data compiled by: Robert L. Brown and Stephen E. Stein
Reduced pressure boiling point
Tboil (K) | Pressure (bar) | Reference |
---|---|---|
418. to 423. | 0.003 | Frinton Laboratories Inc., 1986 |

References

Frinton Laboratories Inc., 1986
Frinton Laboratories Inc.,
Catalog Number 11, Frinton Laboratories Inc., Vineland, NJ, 1986, 99. [all data]