3,4,4-Trimethyl-3-pentanol
- Formula: C8H18O
- Molecular weight: 130.2279
- IUPAC Standard InChIKey: KLIHWYNSISMOMR-UHFFFAOYSA-N
- CAS Registry Number: 7294-05-5
- Chemical structure:
View 3d structure (requires JavaScript / HTML 5) - Other names: 2,2,3-Trimethyl-3-pentanol; 3-Pentanol, 2,2,3-trimethyl-; 2,2,3-trimethylpentan-3-ol

Phase change data

Data compiled as indicated in comments:
TRC - Thermodynamics Research Center, NIST Boulder Laboratories, Chris Muzny director
AC - William E. Acree, Jr., James S. Chickos
Quantity | Value | Units | Method | Reference | Comment |
---|---|---|---|---|---|
Tboil | 426.65 | K | N/A | Ginnings and Coltrane, 1939 | Uncertainty assigned by TRC = 3. K; TRC |
Tboil | 423.65 | K | N/A | Clarke and Jones, 1912 | Uncertainty assigned by TRC = 3. K; TRC |
Enthalpy of vaporization
ΔvapH (kJ/mol) | Temperature (K) | Reference | Comment |
---|---|---|---|
47.3 | 333. | Wilhoit and Zwolinski, 1973 | Based on data from 318. to 426. K.; AC |

Normal alkane RI, polar column, isothermal

View large format table.

Column type Active phase Temperature (C) I Reference Comment
PackedPEG100.1264.Dowling, Evans, et al., 1990Phasesep W (10 %)
PackedPEG100.1289.Dowling, Evans, et al., 1990Phasesep W (10 %)

References

Ginnings and Coltrane, 1939
Ginnings, P.M.; Coltrane, D.,
Aqueous Solubility of 2,2,3-Trimethylpentanol-3,
J. Am. Chem. Soc., 1939, 61, 525-525. [all data]
Clarke and Jones, 1912
Clarke, L.; Jones, W.N.,
2,2,3-Trimethylpentane,
J. Am. Chem. Soc., 1912, 34, 170. [all data]
Wilhoit and Zwolinski, 1973
Wilhoit, R.C.; Zwolinski, B.J.,
Physical and thermodynamic properties of aliphatic alcohols,
J. Phys. Chem. Ref. Data Suppl., 1973, 1, 2, 1. [all data]