cis-Calamenene
- Formula: C15H22
- Molecular weight: 202.3352
- IUPAC Standard InChIKey: PGTJIOWQJWHTJJ-STQMWFEESA-N
- CAS Registry Number: 72937-55-4
- Chemical structure:
View 3d structure (requires JavaScript / HTML 5) - Species with the same structure:
- Stereoisomers:
- Other names: (1S,4S)-1,6-dimethyl-4-(propan-2-yl)-1,2,3,4-tetrahydronaphthalene; (1S,4S)-4-Isopropyl-1,6-dimethyl-1,2,3,4-tetrahydronaphthalene; IT SHOULD BE NOTED THAT cis-calamenene is eluted late vs trans-calamenene

Van Den Dool and Kratz RI, non-polar column, custom temperature program

Column type | Active phase | I | Reference | Comment |
---|---|---|---|---|
Capillary | HP-5MS | 1531.4 | Andriamaharavo, 2014 | 30. m/0.25 mm/0.25 μm, He; Program: 60C (1 min) => 5 C/min => 210C => 10 C/min => 280C (15 min) |

References

Andriamaharavo, 2014
Andriamaharavo, N.R.,
Retention Data. NIST Mass Spectrometry Data Center., NIST Mass Spectrometry Data Center, 2014. [all data]