Propaphos
- Formula: C13H21O4PS
- Molecular weight: 304.342
- IUPAC Standard InChIKey: PWYIUEFFPNVCMW-UHFFFAOYSA-N
- CAS Registry Number: 7292-16-2
- Chemical structure:
View 3d structure (requires JavaScript / HTML 5) - Permanent link for this species. Use this link for bookmarking this species for future reference.

Normal alkane RI, non-polar column, isothermal

Column type | Active phase | Temperature (C) | I | Reference | Comment |
---|---|---|---|---|---|
Packed | OV-1 | 190. | 2075. | TSunoda, 1986 | Helium, Chromosorb W AW DMCS; Column length: 1. m |

Normal alkane RI, non-polar column, temperature ramp

Column type | Active phase | I | Reference | Comment |
---|---|---|---|---|
Packed | OV-1 | 2070. | TSunoda, 1986 | Helium, Chromosorb W AW DMCS, 4. K/min, 210. C @ 20. min; Column length: 1. m; Tstart: 140. C |

Normal alkane RI, non-polar column, custom temperature program

Column type | Active phase | I | Reference | Comment |
---|---|---|---|---|
Capillary | Ultra-1 | 2045. | Tameo and Kiyos, 1991 | Program: not specified |

Normal alkane RI, polar column, custom temperature program

Column type | Active phase | I | Reference | Comment |
---|---|---|---|---|
Capillary | Carbowax 20M | 3021. | Tameo and Kiyos, 1991 | Program: not specified |

References

TSunoda, 1986
TSunoda, N.,
Simultaneous determination of organophosphorous pesticides in forencis chemistry by gas-liquid chromatography with hydrogen flame ionization detector,
Eisei Kagaku, 1986, 32, 2, 91-100, https://doi.org/10.1248/jhs1956.32.91
. [all data]
Tameo and Kiyos, 1991
Tameo, O.; Kiyos, I.,
Simultaneous determination of pesticides by capillary gas chromatography,
Cannot be traslated (in Japan), 1991, 14, 2, 109-122. [all data]