2,2,2-Trichloro-N,N-dimethylacetamide
- Formula: C4H6Cl3NO
- Molecular weight: 190.456
- IUPAC Standard InChIKey: WGBMKQSRUSKSOM-UHFFFAOYSA-N
- CAS Registry Number: 7291-33-0
- Chemical structure:
View 3d structure (requires JavaScript / HTML 5) - Other names: Acetamide, 2,2,2-trichloro-N,N-dimethyl-; Trichloroacetamide, N,N-dimethyl-

Phase change data

Data compiled by: Robert L. Brown and Stephen E. Stein
Quantity | Value | Units | Method | Reference | Comment |
---|---|---|---|---|---|
Tboil | 503. to 506. | K | N/A | Frinton Laboratories Inc., 1986 |

References

Frinton Laboratories Inc., 1986
Frinton Laboratories Inc.,
Catalog Number 11, Frinton Laboratories Inc., Vineland, NJ, 1986, 99. [all data]