1-Methoxydecane
- Formula: C11H24O
- Molecular weight: 172.3077
- IUPAC Standard InChIKey: JPEWDCTZJFUITH-UHFFFAOYSA-N
- CAS Registry Number: 7289-52-3
- Chemical structure:

Gas phase thermochemistry data

Data compiled by: Hussein Y. Afeefy, Joel F. Liebman, and Stephen E. Stein
Quantity | Value | Units | Method | Reference | Comment |
---|---|---|---|---|---|
ΔfH°gas | -91.08 ± 0.51 | kcal/mol | Ccb | Fenwick, Harrop, et al., 1975 |

Condensed phase thermochemistry data

Data compiled as indicated in comments:
ALS - Hussein Y. Afeefy, Joel F. Liebman, and Stephen E. Stein
DH - Eugene S. Domalski and Elizabeth D. Hearing
Quantity | Value | Units | Method | Reference | Comment |
---|---|---|---|---|---|
ΔfH°liquid | -105.97 ± 0.51 | kcal/mol | Ccb | Fenwick, Harrop, et al., 1975 | ALS |
Quantity | Value | Units | Method | Reference | Comment |
ΔcH°liquid | -1748.37 | kcal/mol | Ccb | Fenwick, Harrop, et al., 1975 | Corresponding ΔfHºliquid = -105.97 kcal/mol (simple calculation by NIST; no Washburn corrections); ALS |
Quantity | Value | Units | Method | Reference | Comment |
S°liquid | 117.2 | cal/mol*K | N/A | Andon and Martin, 1975 | DH |
Constant pressure heat capacity of liquid
Cp,liquid (cal/mol*K) | Temperature (K) | Reference | Comment |
---|---|---|---|
88.62 | 298.15 | Andon and Martin, 1975 | T = 12 to 350 K.; DH |
88.55 | 298.15 | Fenwick, Harrop, et al., 1975, 2 | DH |

Phase change data

Data compiled as indicated in comments:
TRC - Thermodynamics Research Center, NIST Boulder Laboratories, Chris Muzny director
AC - William E. Acree, Jr., James S. Chickos
ALS - Hussein Y. Afeefy, Joel F. Liebman, and Stephen E. Stein
DH - Eugene S. Domalski and Elizabeth D. Hearing
Quantity | Value | Units | Method | Reference | Comment |
---|---|---|---|---|---|
Ttriple | 243.42 | K | N/A | Andon and Martin, 1975, 2 | Uncertainty assigned by TRC = 0.07 K; TRC |
Quantity | Value | Units | Method | Reference | Comment |
ΔvapH° | 14.9 | kcal/mol | N/A | Majer and Svoboda, 1985 | |
ΔvapH° | 15.0 | kcal/mol | N/A | Ambrose, Ellender, et al., 1976 | Based on data from 341. to 471. K.; AC |
ΔvapH° | 14.89 ± 0.07 | kcal/mol | C | Fenwick, Harrop, et al., 1975 | ALS |
ΔvapH° | 14.9 ± 0.07 | kcal/mol | C | Fenwick, Harrop, et al., 1975 | AC |
Enthalpy of vaporization
ΔvapH (kcal/mol) | Temperature (K) | Method | Reference | Comment |
---|---|---|---|---|
13.6 | 356. | A | Stephenson and Malanowski, 1987 | Based on data from 341. to 429. K.; AC |
13.6 | 356. | A | Stephenson and Malanowski, 1987 | Based on data from 341. to 471. K. See also Ambrose, Ellender, et al., 1976.; AC |
10.9 | 489. | N/A | Ambrose, Ellender, et al., 1976 | Based on data from 341. to 471. K.; AC |
Enthalpy of fusion
ΔfusH (kcal/mol) | Temperature (K) | Reference | Comment |
---|---|---|---|
7.5813 | 243.47 | Andon and Martin, 1975 | DH |
7.579 | 243.5 | Domalski and Hearing, 1996 | AC |
Entropy of fusion
ΔfusS (cal/mol*K) | Temperature (K) | Reference | Comment |
---|---|---|---|
31.145 | 243.47 | Andon and Martin, 1975 | DH |

References

Fenwick, Harrop, et al., 1975
Fenwick, J.O.; Harrop, D.; Head, A.J.,
Thermodynamic properties of organic oxygen compounds. 41. Enthalpies of formation of eight ethers,
J. Chem. Thermodyn., 1975, 7, 943-954. [all data]
Andon and Martin, 1975
Andon, R.J.L.; Martin, J.F.,
Thermodynamic properties of organic oxygen compounds. 40. Heat capacity and entropy of six ethers,
J. Chem. Thermodynam., 1975, 7, 593-606. [all data]
Fenwick, Harrop, et al., 1975, 2
Fenwick, J.O.; Harrop, D.; Head, A.J.,
Thermodynamic properties of organic oxygen compounds. 41. Enthalpies of formation of eight ethers,
J. Chem. Thermodynam., 1975, 7, 944-954. [all data]
Andon and Martin, 1975, 2
Andon, R.J.L.; Martin, J.F.,
Thermodynamic Properties of Organic Oxygen Compounds 40. Heat Capacity and Entropy of Six Ethers,
J. Chem. Thermodyn., 1975, 7, 593. [all data]
Majer and Svoboda, 1985
Majer, V.; Svoboda, V.,
Enthalpies of Vaporization of Organic Compounds: A Critical Review and Data Compilation, Blackwell Scientific Publications, Oxford, 1985, 300. [all data]
Ambrose, Ellender, et al., 1976
Ambrose, D.; Ellender, J.H.; Sprake, C.H.S.; Townsend, R.,
Thermodynamic properties of organic oxygen compounds XLIII. Vapour pressures of some ethers,
The Journal of Chemical Thermodynamics, 1976, 8, 2, 165-178, https://doi.org/10.1016/0021-9614(76)90090-2
. [all data]
Stephenson and Malanowski, 1987
Stephenson, Richard M.; Malanowski, Stanislaw,
Handbook of the Thermodynamics of Organic Compounds, 1987, https://doi.org/10.1007/978-94-009-3173-2
. [all data]
Domalski and Hearing, 1996
Domalski, Eugene S.; Hearing, Elizabeth D.,
Heat Capacities and Entropies of Organic Compounds in the Condensed Phase. Volume III,
J. Phys. Chem. Ref. Data, 1996, 25, 1, 1, https://doi.org/10.1063/1.555985
. [all data]