Benzoic acid, 3-amino-2,5-dichloro-, methyl ester
- Formula: C8H7Cl2NO2
- Molecular weight: 220.053
- IUPAC Standard InChIKey: DTSSCQVCVYZGSI-UHFFFAOYSA-N
- CAS Registry Number: 7286-84-2
- Chemical structure:
View 3d structure (requires JavaScript / HTML 5) - Other names: Amiben, methyl ester; Chloramben methyl; Chloramben, methyl ester; Methyl 3-amino-2,5-dichlorobenzoate; 2,5-Dichloro-3-aminobenzoic acid, methyl ester; Amchem 65-81-b; Methyl chloramben; 3-Amino-2,5-dichlorobenzoic acid, methyl ester; Benzoic acid, 3-amino-2,5-dichloro-, methylated; NSC 190368

Phase change data

Data compiled by: Thermodynamics Research Center, NIST Boulder Laboratories, Chris Muzny director
Quantity | Value | Units | Method | Reference | Comment |
---|---|---|---|---|---|
Tfus | 335.09 | K | N/A | Donnelly, Drewes, et al., 1990 | Uncertainty assigned by TRC = 0.5 K |

References

Donnelly, Drewes, et al., 1990
Donnelly, J.R.; Drewes, L.A.; Johnson, R.L.; Munslow, W.D.; Knapp, K.K.; Sovocool, G.W.,
Purity and heat of fusion data for environmental standards as determined by differential scanning calorimetry,
Thermochim. Acta, 1990, 167, 2, 155, https://doi.org/10.1016/0040-6031(90)80476-F
. [all data]