Methyl allylthioacetate
- Formula: C6H10O2S
- Molecular weight: 146.207
- IUPAC Standard InChIKey: XUIRWMWZYBMPQC-UHFFFAOYSA-N
- CAS Registry Number: 72867-23-3
- Chemical structure:

Phase change data

Data compiled by: Robert L. Brown and Stephen E. Stein
Reduced pressure boiling point
Tboil (K) | Pressure (bar) | Reference |
---|---|---|
315. to 316. | 0.0001 | Frinton Laboratories Inc., 1986 |

Van Den Dool and Kratz RI, polar column, temperature ramp

Column type | Active phase | I | Reference | Comment |
---|---|---|---|---|
Capillary | FFAP | 1518. | Calvo-Gómez, Morales-López, et al., 2004 | 30. m/0.25 mm/0.25 μm, He, 40. C @ 3. min, 5. K/min; Tend: 220. C |

References

Frinton Laboratories Inc., 1986
Frinton Laboratories Inc.,
Catalog Number 11, Frinton Laboratories Inc., Vineland, NJ, 1986, 99. [all data]
Calvo-Gómez, Morales-López, et al., 2004
Calvo-Gómez, O.; Morales-López, J.; López, M.G.,
Solid-phase microextraction-gas chromatographic-mass spectrometric analysis of garlic oil obtained by hydrodistillation,
J. Chromatogr. A, 2004, 1036, 1, 91-93, https://doi.org/10.1016/j.chroma.2004.02.072
. [all data]