Cyclohexyl ethylphosphonofluoridate
- Formula: C8H16FO2P
- Molecular weight: 194.1836
- IUPAC Standard InChIKey: HKXZLMRREPHTIZ-UHFFFAOYSA-N
- CAS Registry Number: 7284-84-6
- Chemical structure:
View 3d structure (requires JavaScript / HTML 5) - Other names: Phosphonofluoridic acid, ethyl-, cycloheptyl ester; Ethylphoshonic acid, fluoroanhydride, cyclohexyl ester; Phosphonofluoridic acid, P-ethyl-, cyclohexyl ester

Van Den Dool and Kratz RI, non-polar column, temperature ramp

Column type | Active phase | I | Reference | Comment |
---|---|---|---|---|
Capillary | SE-54 | 1307. | Kostiainen, 2000 | 25. m/0.32 mm/0.25 μm, He, 40. C @ 1. min, 10. K/min, 280. C @ 10. min |

Normal alkane RI, non-polar column, temperature ramp

Column type | Active phase | I | Reference | Comment |
---|---|---|---|---|
Capillary | HP-5MS | 1308. | Sliwakowski, Jasinska, et al., 2000 | 30. m/0.25 mm/0.25 μm, 40. C @ 2. min, 10. K/min, 270. C @ 5. min |
Capillary | SE-54 | 1307.1 | Söderström, Ketola, et al., 1995 | 25. m/0.32 mm/0.25 μm, He, 40. C @ 2. min, 10. K/min, 250. C @ 10. min |

Normal alkane RI, non-polar column, custom temperature program

Column type | Active phase | I | Reference | Comment |
---|---|---|---|---|
Capillary | 5 % Phenyl methyl siloxane | 1307. | OPCW, 1997 | Program: not specified |

References

Kostiainen, 2000
Kostiainen, O.,
Gas Chromatography in Screening of Chemicals Related to the Chemical Weapons Convention
in Encyclopedia of Analytical Chemistry, Meyers, R.A., ed(s)., John Wiley Sons Ltd, Chichester, 2000, 963-979. [all data]
Sliwakowski, Jasinska, et al., 2000
Sliwakowski, M.; Jasinska, J.; Chalas, A.,
Effect of the allyl substituent on changes of retention index values and mass spectra of O-alkyl alkylphosphonofluoridates. Part 1. O-Cycloalkyl derivatives.,
Wojskowy Institut Chemii i Radiometrii. Biuletyn Informacyjny WIChiR, 2000, 1, 30, 13-20. [all data]
Söderström, Ketola, et al., 1995
Söderström, M.T.; Ketola, R.A.; Kostiainen, O.,
Identification of some nerve agent homologues and dialkyl methylphosphonates by gas chromatography/Fourier transform infrared spectrometry. Part II. Spectral search with the help of retention indices,
Fresenius J. Anal. Chem., 1995, 352, 6, 550-556, https://doi.org/10.1007/BF00323072
. [all data]
OPCW, 1997
OPCW,
Conference of the States Parties C-I/DEC.64 (22 May 1997), 1997, retrieved from http://www.opcw.org/html/global/cseries/csp1/CIDEC64.html. [all data]