3,5-Bis(trifluoromethyl)benzoic acid
- Formula: C9H4F6O2
- Molecular weight: 258.1173
- IUPAC Standard InChIKey: HVFQJWGYVXKLTE-UHFFFAOYSA-N
- CAS Registry Number: 725-89-3
- Chemical structure:

Reaction thermochemistry data

Data compiled by: John E. Bartmess
Individual Reactions
C9H3F6O2- + =
By formula: C9H3F6O2- + H+ = C9H4F6O2
Quantity | Value | Units | Method | Reference | Comment |
---|---|---|---|---|---|
ΔrH° | 1357. ± 8.8 | kJ/mol | G+TS | Jinfeng, Topsom, et al., 1988 | gas phase; value altered from reference due to change in acidity scale |
Quantity | Value | Units | Method | Reference | Comment |
ΔrG° | 1328. ± 8.4 | kJ/mol | IMRE | Jinfeng, Topsom, et al., 1988 | gas phase; value altered from reference due to change in acidity scale |

Gas phase ion energetics data

Data compiled by: John E. Bartmess
De-protonation reactions
C9H3F6O2- + =
By formula: C9H3F6O2- + H+ = C9H4F6O2
Quantity | Value | Units | Method | Reference | Comment |
---|---|---|---|---|---|
ΔrH° | 1357. ± 8.8 | kJ/mol | G+TS | Jinfeng, Topsom, et al., 1988 | gas phase; value altered from reference due to change in acidity scale |
Quantity | Value | Units | Method | Reference | Comment |
ΔrG° | 1328. ± 8.4 | kJ/mol | IMRE | Jinfeng, Topsom, et al., 1988 | gas phase; value altered from reference due to change in acidity scale |

References

Jinfeng, Topsom, et al., 1988
Jinfeng, C.; Topsom, R.D.; Headley, A.D.; Koppel, I.; Mishima, M.; Taft, R.W.; Veji, S.,
Acidities of Substituted Acetic Acids,
J. Mol. Struct., 1988, 168, 141, https://doi.org/10.1016/0166-1280(88)80349-X
. [all data]