p,p'-DDE
- Formula: C14H8Cl4
- Molecular weight: 318.025
- IUPAC Standard InChIKey: UCNVFOCBFJOQAL-UHFFFAOYSA-N
- CAS Registry Number: 72-55-9
- Chemical structure:
View 3d structure (requires JavaScript / HTML 5) - Other names: Benzene, 1,1'-(dichloroethenylidene)bis[4-chloro-; Ethylene, 1,1-dichloro-2,2-bis(p-chlorophenyl)-; DDE; 1,1-Dichloro-2,2-Bis(p-chlorophenyl)ethylene; 1,1-Dichloro-2,2-di(p-chlorophenyl)ethylene; 2,2-Bis(4-chlorophenyl)-1,1-dichloroethylene; 4,4'-DDE; 2,2-Bis(p-chlorophenyl)-1,1-dichloroethylene; p,p'-(Dichlorodiphenyl)-2,2-dichloroethylene; DDT dehydrochloride; NCI-C00555; 1,1-Bis(p-chlorophenyl)-2,2-dichloroethylene; 1,1-Dichloro-2,2-bis(p-chlorophenyl)ethene; 1,1'-(Dichloroethenylidene)bis(4-chlorobenzene); 2,2-Bis(4-chlorophenyl)-1,1-dichloroethene; Dichlorodiphenyldichloroethylene; DDE(p,p'); NSC 1153; p,p'-Dichlorodiphenyldichloroethylene; p,p-Dde; 1,1-Dichloro-2,2-bis(4-chlorophenyl)ethylene (p,p'-DDE)

Phase change data

Data compiled as indicated in comments:
TRC - Thermodynamics Research Center, NIST Boulder Laboratories, Chris Muzny director
AC - William E. Acree, Jr., James S. Chickos
Quantity | Value | Units | Method | Reference | Comment |
---|---|---|---|---|---|
Tfus | 360.56 | K | N/A | Donnelly, Drewes, et al., 1990 | Uncertainty assigned by TRC = 0.2 K; TRC |
Tfus | 363.0 | K | N/A | Plato and Glasgow, 1969 | Uncertainty assigned by TRC = 0.2 K; TRC |
Enthalpy of vaporization
ΔvapH (kJ/mol) | Temperature (K) | Method | Reference | Comment |
---|---|---|---|---|
87.2 | 398. | GC | Hinckley, Bidleman, et al., 1990 | Based on data from 343. to 453. K.; AC |
Enthalpy of fusion
ΔfusH (kJ/mol) | Temperature (K) | Method | Reference | Comment |
---|---|---|---|---|
23.55 | 360.4 | DSC | Donnelly, Drewes, et al., 1990, 2 | AC |

Kovats' RI, non-polar column, isothermal

View large format table.

Column type Active phase Temperature (C) I Reference Comment
PackedApiezon L215.2180.Heinzen and Yunes, 1992Chromosorb W; Column length: 1.8 m
PackedApiezon L215.2132.Heinzen and Yunes, 1992Chromosorb W; Column length: 1.8 m
PackedOV-1200.2136.Dubsky, Hána, et al., 1979Column length: 2. m

Kovats' RI, non-polar column, custom temperature program

View large format table.

Column type Active phase I Reference Comment
PackedSE-302130.Ramsey, Lee, et al., 1980He, Chromosorb G HP (80-100 mesh); Column length: 1.5 m; Program: not specified

Van Den Dool and Kratz RI, non-polar column, temperature ramp

View large format table.

Column type Active phase I Reference Comment
CapillaryOV-12113.de Paoli, Taccheo-Barbina, et al., 199125. m/0.32 mm/0.10 μm, 160. C @ 1. min, 1. K/min; Tend: 240. C
CapillaryOV-12116.de Paoli, Taccheo-Barbina, et al., 199125. m/0.32 mm/0.10 μm, 160. C @ 1. min, 1. K/min; Tend: 240. C
CapillaryOV-12111.de Paoli, Taccheo-Barbina, et al., 199125. m/0.32 mm/0.10 μm, 160. C @ 1. min, 1.3 K/min; Tend: 240. C
CapillaryOV-12120.de Paoli, Taccheo-Barbina, et al., 199125. m/0.32 mm/0.10 μm, 160. C @ 1. min, 1.3 K/min; Tend: 240. C
CapillaryOV-12113.de Paoli, Taccheo-Barbina, et al., 199125. m/0.32 mm/0.10 μm, 160. C @ 1. min, 1.5 K/min; Tend: 240. C
CapillaryOV-12117.de Paoli, Taccheo-Barbina, et al., 199125. m/0.32 mm/0.10 μm, 160. C @ 1. min, 1.5 K/min; Tend: 240. C
CapillaryOV-12116.de Paoli, Taccheo-Barbina, et al., 199125. m/0.32 mm/0.10 μm, 160. C @ 1. min, 2. K/min; Tend: 240. C
CapillaryOV-12121.de Paoli, Taccheo-Barbina, et al., 199125. m/0.32 mm/0.10 μm, 160. C @ 1. min, 2. K/min; Tend: 240. C
CapillaryCP Sil 5 CB2112.Wells, Gillespie, et al., 1985120. C @ 1. min, 3. K/min; Column length: 25. m; Column diameter: 0.22 mm; Tend: 250. C

Normal alkane RI, non-polar column, temperature ramp

View large format table.

Column type Active phase I Reference Comment
CapillaryHP-52208.Murayama, Mukai, et al., 200030. m/0.32 mm/0.25 μm, 50. C @ 1. min, 10. K/min, 300. C @ 4. min

Normal alkane RI, non-polar column, custom temperature program

View large format table.

Column type Active phase I Reference Comment
Capillary5 % Phenyl methyl siloxane2196.Department of Food Safety and Welfare, 200630. m/0.25 mm/0.25 μm, Helium; Program: 50 0C(1 min) 25 0C/min -> 125 0C 10 0C/min -> 300 0C (10 min)
Capillary5 % Phenyl methyl siloxane2192.Department of Food Safety and Welfare, 200630. m/0.25 mm/0.25 μm, Helium; Program: 50 0C(1 min) 25 0C/min -> 125 0C 10 0C/min -> 300 0C (10 min)
CapillaryUltra-12111.Tameo and Kiyos, 1991Program: not specified
CapillaryOV-1, SE-30, Methyl silicone, SP-2100, OV-101, DB-1, etc.2110.Waggott and Davies, 1984Hydrogen; Column length: 50. m; Column diameter: 0.32 mm; Program: not specified
CapillaryOV-1, SE-30, Methyl silicone, SP-2100, OV-101, DB-1, etc.2130.Waggott and Davies, 1984Hydrogen; Column length: 50. m; Column diameter: 0.32 mm; Program: not specified
OtherMethyl Silicone2130.Ardrey and Moffat, 1981Program: not specified

Normal alkane RI, polar column, custom temperature program

View large format table.

Column type Active phase I Reference Comment
CapillaryCarbowax 20M2990.Tameo and Kiyos, 1991Program: not specified

Lee's RI, non-polar column, custom temperature program

View large format table.

Column type Active phase I Reference Comment
CapillarySE-54362.9Peterman and Delfino, 199015. m/0.25 mm/0.25 μm, He; Program: 125 0C (15 min) 1 0C/min -> 131 0C 4 0C/min -> 247 0C 8 0C/min -> 280 0C (15 min)

References

Donnelly, Drewes, et al., 1990
Donnelly, J.R.; Drewes, L.A.; Johnson, R.L.; Munslow, W.D.; Knapp, K.K.; Sovocool, G.W.,
Purity and heat of fusion data for environmental standards as determined by differential scanning calorimetry,
Thermochim. Acta, 1990, 167, 2, 155, https://doi.org/10.1016/0040-6031(90)80476-F
. [all data]
Plato and Glasgow, 1969
Plato, C.; Glasgow, A.R., Jr.,
Differential scanning calorimetry as a general method for determining the purity and heat of fusion of high-purity organic chemicals. Application to 95 compounds,
Anal. Chem., 1969, 41, 2, 330, https://doi.org/10.1021/ac60271a041
. [all data]
Hinckley, Bidleman, et al., 1990
Hinckley, Daniel A.; Bidleman, Terry F.; Foreman, William T.; Tuschall, Jack R.,
Determination of vapor pressures for nonpolar and semipolar organic compounds from gas chromatograhic retention data,
J. Chem. Eng. Data, 1990, 35, 3, 232-237, https://doi.org/10.1021/je00061a003
. [all data]
Donnelly, Drewes, et al., 1990, 2
Donnelly, J.R.; Drewes, L.A.; Johnson, R.L.; Munslow, W.D.; Knapp, K.K.; Sovocool, G.W.,
Purity and heat of fusion data for environmental standards as determined by differential scanning calorimetry,
Thermochimica Acta, 1990, 167, 2, 155-187, https://doi.org/10.1016/0040-6031(90)80476-F
. [all data]