1,1-Dichloro-2,2-bis(p-chlorophenyl)ethane
- Formula: C14H10Cl4
- Molecular weight: 320.041
- IUPAC Standard InChIKey: AHJKRLASYNVKDZ-UHFFFAOYSA-N
- CAS Registry Number: 72-54-8
- Chemical structure:
View 3d structure (requires JavaScript / HTML 5) - Other names: Benzene, 1,1'-(2,2-dichloroethylidene)bis[4-chloro-; Ethane, 1,1-dichloro-2,2-bis(p-chlorophenyl)-; p,p'-(Dichlorodiphenyl)dichloroethane; p,p'-TDE; Dichlorodiphenyldichloroethane; Dilene; DDD; ME1700; Rhothane; TDE; 1,1-Bis(p-Chlorophenyl)-2,2-dichloroethane; 1,1-Bis(4-chlorophenyl)-2,2-dichloroethane; 1,1-Dichloro-2,2-bis(4-chlorophenyl)ethane; 2,2-Bis(p-chlorophenyl)-1,1-dichloroethane; 2,2-Bis(4-chlorophenyl)-1,1-dichloroethane; 4,4'-DDD; ENT 4,225; NCI-C00475; Rhothane D-3; Rothane; Tetrachlorodiphenylethane; 1,1-Dichloor-2,2-bis(4-chloor fenyl)-ethaan; 1,1-Dichlor-2,2-bis(4-chlor-phenyl)-aethan; 1,1-Dichloro-2,2-di(4-chlorophenyl)ethane; 1,1-Dicloro-2,2-bis(4-cloro-fenil)-etano; 1,1-Dichloro-2,2-bis(parachlorophenyl)ethane; OMS 1078; Rcra waste number U060; p,p'-Dichlorodiphenyl-2,2-dichloroethylene; p,p'-DDD; Ethane, 1,1-dichloro-2,2-bis(4-chlorophenyl)-; DDD(p,p'); NSC 8941; p,p-Ddd; 1,1-Dichloro-2,2-bis(4-chlorophenyl)ethane p,p'-DDD

Phase change data

Data compiled as indicated in comments:
TRC - Thermodynamics Research Center, NIST Boulder Laboratories, Chris Muzny director
AC - William E. Acree, Jr., James S. Chickos
Quantity | Value | Units | Method | Reference | Comment |
---|---|---|---|---|---|
Tfus | 383.41 | K | N/A | Donnelly, Drewes, et al., 1990 | Uncertainty assigned by TRC = 0.2 K; TRC |
Tfus | 382.3 | K | N/A | Plato and Glasgow, 1969 | Uncertainty assigned by TRC = 0.2 K; TRC |
Enthalpy of vaporization
ΔvapH (kJ/mol) | Temperature (K) | Method | Reference | Comment |
---|---|---|---|---|
88.5 | 398. | GC | Hinckley, Bidleman, et al., 1990 | Based on data from 343. to 453. K.; AC |
Enthalpy of fusion
ΔfusH (kJ/mol) | Temperature (K) | Method | Reference | Comment |
---|---|---|---|---|
27.31 | 382.1 | DSC | Acree, 1991 | See also Donnelly, Drewes, et al., 1990, 2.; AC |

Kovats' RI, non-polar column, isothermal

Column type | Active phase | Temperature (C) | I | Reference | Comment |
---|---|---|---|---|---|
Packed | Apiezon L | 215. | 2272. | Heinzen and Yunes, 1992 | Chromosorb W; Column length: 1.8 m |
Packed | OV-1 | 200. | 2199. | Dubsky, Hána, et al., 1979 | Column length: 2. m |

Kovats' RI, non-polar column, custom temperature program

Column type | Active phase | I | Reference | Comment |
---|---|---|---|---|
Packed | SE-30 | 2200. | Ramsey, Lee, et al., 1980 | He, Chromosorb G HP (80-100 mesh); Column length: 1.5 m; Program: not specified |

Van Den Dool and Kratz RI, non-polar column, temperature ramp

Column type | Active phase | I | Reference | Comment |
---|---|---|---|---|
Capillary | OV-1 | 2196. | de Paoli, Taccheo-Barbina, et al., 1991 | 25. m/0.32 mm/0.10 μm, 160. C @ 1. min, 1. K/min; Tend: 240. C |
Capillary | OV-1 | 2203. | de Paoli, Taccheo-Barbina, et al., 1991 | 25. m/0.32 mm/0.10 μm, 160. C @ 1. min, 1. K/min; Tend: 240. C |
Capillary | OV-1 | 2208. | de Paoli, Taccheo-Barbina, et al., 1991 | 25. m/0.32 mm/0.10 μm, 160. C @ 1. min, 1.3 K/min; Tend: 240. C |
Capillary | OV-1 | 2196. | de Paoli, Taccheo-Barbina, et al., 1991 | 25. m/0.32 mm/0.10 μm, 160. C @ 1. min, 1.5 K/min; Tend: 240. C |
Capillary | OV-1 | 2203. | de Paoli, Taccheo-Barbina, et al., 1991 | 25. m/0.32 mm/0.10 μm, 160. C @ 1. min, 1.5 K/min; Tend: 240. C |
Capillary | OV-1 | 2208. | de Paoli, Taccheo-Barbina, et al., 1991 | 25. m/0.32 mm/0.10 μm, 160. C @ 1. min, 2. K/min; Tend: 240. C |

Normal alkane RI, non-polar column, custom temperature program

Column type | Active phase | I | Reference | Comment |
---|---|---|---|---|
Capillary | OV-1 | 2213. | Waggott and Davies, 1984 | Hydrogen; Column length: 50. m; Column diameter: 0.32 mm; Program: not specified |
Capillary | OV-1, SE-30, Methyl silicone, SP-2100, OV-101, DB-1, etc. | 2200. | Waggott and Davies, 1984 | Hydrogen; Column length: 50. m; Column diameter: 0.32 mm; Program: not specified |
Capillary | OV-1, SE-30, Methyl silicone, SP-2100, OV-101, DB-1, etc. | 2212. | Waggott and Davies, 1984 | Hydrogen; Column length: 50. m; Column diameter: 0.32 mm; Program: not specified |
Other | Methyl Silicone | 2200. | Ardrey and Moffat, 1981 | Program: not specified |

Normal alkane RI, polar column, custom temperature program

Column type | Active phase | I | Reference | Comment |
---|---|---|---|---|
Capillary | Carbowax 20M | 3310. | Tameo and Kiyos, 1991 | Program: not specified |

References

Donnelly, Drewes, et al., 1990
Donnelly, J.R.; Drewes, L.A.; Johnson, R.L.; Munslow, W.D.; Knapp, K.K.; Sovocool, G.W.,
Purity and heat of fusion data for environmental standards as determined by differential scanning calorimetry,
Thermochim. Acta, 1990, 167, 2, 155, https://doi.org/10.1016/0040-6031(90)80476-F
. [all data]
Plato and Glasgow, 1969
Plato, C.; Glasgow, A.R., Jr.,
Differential scanning calorimetry as a general method for determining the purity and heat of fusion of high-purity organic chemicals. Application to 95 compounds,
Anal. Chem., 1969, 41, 2, 330, https://doi.org/10.1021/ac60271a041
. [all data]
Hinckley, Bidleman, et al., 1990
Hinckley, Daniel A.; Bidleman, Terry F.; Foreman, William T.; Tuschall, Jack R.,
Determination of vapor pressures for nonpolar and semipolar organic compounds from gas chromatograhic retention data,
J. Chem. Eng. Data, 1990, 35, 3, 232-237, https://doi.org/10.1021/je00061a003
. [all data]
Acree, 1991
Acree, William E.,
Thermodynamic properties of organic compounds: enthalpy of fusion and melting point temperature compilation,
Thermochimica Acta, 1991, 189, 1, 37-56, https://doi.org/10.1016/0040-6031(91)87098-H
. [all data]
Donnelly, Drewes, et al., 1990, 2
Donnelly, J.R.; Drewes, L.A.; Johnson, R.L.; Munslow, W.D.; Knapp, K.K.; Sovocool, G.W.,
Purity and heat of fusion data for environmental standards as determined by differential scanning calorimetry,
Thermochimica Acta, 1990, 167, 2, 155-187, https://doi.org/10.1016/0040-6031(90)80476-F
. [all data]