Felodipine
- Formula: C18H19Cl2NO4
- Molecular weight: 384.254
- IUPAC Standard InChIKey: RZTAMFZIAATZDJ-UHFFFAOYSA-N
- CAS Registry Number: 72509-76-3
- Chemical structure:
View 3d structure (requires JavaScript / HTML 5) - Other names: 3,5-Pyridinedicarboxylic acid, 4-(2,3-dichlorophenyl)-1,4-dihydro-2,6-dimethyl-, ethyl methyl ester; Ethyl methyl 4-(2,3-dichlorophenyl)-1,4-dihydro-2,6-dimethyl-3,5-pyridinedicarboxylate; (.+/-.) Ethyl methyl 4-(2,3-dichlorophenyl)-1,4-dihydro-2,6-dimethyl-3,5-pyridinedicarboxylate; 4-(2,3-Dichlorophenyl)-1,4-dihydro-2,6-dimethyl-3,5-pyridinecarboxylic acid ethyl methyl ester; Agon; Feloday; Felodipine (dl form); Flodil; H-154/82; Hydac; Munobal; Plendil; Prevex; Splendil; (.+/-.)-Felodipine; dl-Felodipine; Plandil; 3-Ethyl 5-methyl 4-(2,3-dichlorophenyl)-2,6-dimethyl-1,4-dihydro-3,5-pyridinedicarboxylate; (±) Ethyl methyl 1,4-dihydro-2,6-dimethyl-4-(2,3-dichlorophenyl)-3,5-pyridine dicarboxylate (felodipine)

Phase change data

Data compiled by: William E. Acree, Jr., James S. Chickos
Enthalpy of fusion
ΔfusH (kJ/mol) | Temperature (K) | Method | Reference |
---|---|---|---|
34.8 | 412.3 | N/A | Bergström, Wassvik, et al., 2007 |
35.21 | 414.9 | DSC | Srcic, Kerc, et al., 1992 |

Van Den Dool and Kratz RI, non-polar column, custom temperature program

Column type | Active phase | I | Reference | Comment |
---|---|---|---|---|
Capillary | VF-5MS | 2718.2 | Tret'yakov, 2008 | 30. m/0.25 mm/0.25 μm, He; Program: Multi-step temperature program; T(initial)=60C; T(final)=270C |

References

Bergström, Wassvik, et al., 2007
Bergström, Christel A.S.; Wassvik, Carola M.; Johansson, Kajsa; Hubatsch, Ina,
Poorly Soluble Marketed Drugs Display Solvation Limited Solubility,
J. Med. Chem., 2007, 50, 23, 5858-5862, https://doi.org/10.1021/jm0706416
. [all data]
Srcic, Kerc, et al., 1992
Srcic, S.; Kerc, J.; Urleb, U.; Zupancic, I.; Lahajnar, G.; Kofler, B.; Smid-Korbar, J.,
Investigation of felodipine polymorphism and its glassy state,
International Journal of Pharmaceutics, 1992, 87, 1-3, 1-10, https://doi.org/10.1016/0378-5173(92)90221-M
. [all data]
Tret'yakov, 2008
Tret'yakov, K.V.,
Retention Data. NIST Mass Spectrometry Data Center., NIST Mass Spectrometry Data Center, 2008. [all data]