Alizarin
- Formula: C14H8O4
- Molecular weight: 240.2109
- IUPAC Standard InChIKey: RGCKGOZRHPZPFP-UHFFFAOYSA-N
- CAS Registry Number: 72-48-0
- Chemical structure:
View 3d structure (requires JavaScript / HTML 5) - Other names: 1,2-Dihydroxyanthraquinone; Alizarin red; 9,10-Anthracenedione, 1,2-dihydroxy-; Alizarin B; Alizarina; Alizarine; Alizarine B; Alizarine Indicator; Alizarine L Paste; Alizarine Lake Red IPX; Alizarine Lake Red 2P; Alizarine Lake Red 3P; Alizarine NAC; Alizarine Paste 20 percent Bluish; Alizarine Red; Alizarine Red B; Alizarine Red B2; Alizarine Red IP; Alizarine Red IPP; Alizarine Red L; Alizarine 3B; Alizerine NAC; Alizerine Red IPP; Anthraquinone, 1,2-dihydroxy-; C.I. Mordant Red 11; C.I. Mordant Red 11C; C.I. Pigment Red 83; C.I. Pigment Red 83C; C.I. 58000; C.I. 58000C; Certiqual Alizarine; Certiqual Alizarine D; D and C Orange Number 15D; D And C Orange Number 15; Deep Crimson Madder 10821; Deep Crimson Madder 10821E; Eljon Madder; Eljon Madder M; Mitsui Alizarine B; Mitsui Alizarine BS; Mordant Red 11; Sanyo Carmine L2B; Turkey Red; Turkey Red W; 1,2-Anthraquinonediol; 1,2-Dihydroxy-9,10-anthraquinone; 1,2-Dihydroxyanthrachinon; Alizarine paste 20% bluish; Pincoffin

Phase change data

Data compiled by: William E. Acree, Jr., James S. Chickos
Enthalpy of sublimation
ΔsubH (kJ/mol) | Temperature (K) | Method | Reference | Comment |
---|---|---|---|---|
123.8 | 383. | A | Stephenson and Malanowski, 1987 | Based on data from 368. to 498. K. |
121.9 ± 0.5 | 469. | C | Malaspina, Bardi, et al., 1973 | |
121.5 ± 0.4 | 469. | ME | Malaspina, Bardi, et al., 1973 | Based on data from 434. to 505. K. |
123.9 | 403. | ME | Hoyer and Peperle, 1958 |

References

Stephenson and Malanowski, 1987
Stephenson, Richard M.; Malanowski, Stanislaw,
Handbook of the Thermodynamics of Organic Compounds, 1987, https://doi.org/10.1007/978-94-009-3173-2
. [all data]
Malaspina, Bardi, et al., 1973
Malaspina, L.; Bardi, G.; Gigli, R.,
Simultaneous microcalorimetric-Knudsen effusion determination of the sublimation enthalpy and vapor pressure of 1,2- and 1,4-dihydroxy anthraquinones,
The Journal of Chemical Thermodynamics, 1973, 5, 6, 845-850, https://doi.org/10.1016/S0021-9614(73)80046-1
. [all data]
Hoyer and Peperle, 1958
Hoyer, H.; Peperle, W.,
Z. Elektrochem., 1958, 62, 61. [all data]