Maleanilic acid, 4' chloro-
- Formula: C10H8ClNO3
- Molecular weight: 225.628
- IUPAC Standard InChIKey: FBTQVXSNFILAQY-WAYWQWQTSA-N
- CAS Registry Number: 7242-16-2
- Chemical structure:
View 3d structure (requires JavaScript / HTML 5) - Permanent link for this species. Use this link for bookmarking this species for future reference.

Reaction thermochemistry data

Data compiled by: Hussein Y. Afeefy, Joel F. Liebman, and Stephen E. Stein
Individual Reactions
By formula: C6H6ClN + C4H2O3 = C10H8ClNO3
Quantity | Value | Units | Method | Reference | Comment |
---|---|---|---|---|---|
ΔrH° | 13. | kJ/mol | Cm | Srivastava, 1979 | solid phase |

References

Srivastava, 1979
Srivastava, A.K.,
Solid-state reactions between maleic anhydride and substituted aromactic amines,
Z. Phys. Chem. (Leipzig), 1979, 260, 630-640. [all data]