2,2-Dimethoxy-4,4-dimethylpentane
- Formula: C9H20O2
- Molecular weight: 160.2539
- IUPAC Standard InChIKey: GMAZEGHMGUXQHI-UHFFFAOYSA-N
- CAS Registry Number: 72409-07-5
- Chemical structure:
View 3d structure (requires JavaScript / HTML 5) - Permanent link for this species. Use this link for bookmarking this species for future reference.

Reaction thermochemistry data

Data compiled by: Hussein Y. Afeefy, Joel F. Liebman, and Stephen E. Stein
Individual Reactions
By formula: C9H20O2 + H2O = C7H14O + 2CH4O
Quantity | Value | Units | Method | Reference | Comment |
---|---|---|---|---|---|
ΔrH° | 6.870 ± 0.088 | kJ/mol | Cm | Wiberg, 1980 | liquid phase; solvent: Water; Hydrolysis |
ΔrH° | 6.86 ± 0.08 | kJ/mol | Cm | Wiberg and Squires, 1979 | liquid phase; Heat of hydrolysis |

References

Wiberg, 1980
Wiberg, K.B.,
Energies of organic compounds,
Rept. DOE-E(11-1)4060 Prepared for US Dept. of Energy by Yale Univ., New Haven, CT. Avail. NTIS, 1980, 1-24. [all data]
Wiberg and Squires, 1979
Wiberg, K.B.; Squires, R.R.,
Thermodynamics of hydrolysis aliphatic ketals. An entropy component of steric effects,
J. Am. Chem. Soc., 1979, 101, 5512-5515. [all data]