Undecane, 1-cyclohexyl-3-(2-cyclohexylethyl)-
- Formula: C25H48
- Molecular weight: 348.6486
- IUPAC Standard InChIKey: GOJKWWYXSCQHJD-UHFFFAOYSA-N
- CAS Registry Number: 7225-69-6
- Chemical structure:
View 3d structure (requires JavaScript / HTML 5) - Other names: 1-Cyclohexyl-3-(2-cyclohexylethyl)hendecane; 1,5-Dicyclohexyl-3-n-octylpentane; Cyclohexane, 1,1'-(3-octyl-1,5-pentanediyl)bis-; 1-Cyclohexyl-3-(2-cyclohexylethyl)undecane

Phase change data

Data compiled as indicated in comments:
TRC - Thermodynamics Research Center, NIST Boulder Laboratories, Chris Muzny director
AC - William E. Acree, Jr., James S. Chickos
Quantity | Value | Units | Method | Reference | Comment |
---|---|---|---|---|---|
Tfus | 233.15 | K | N/A | Anonymous, 1968 | Uncertainty assigned by TRC = 1. K; TRC |
Enthalpy of vaporization
ΔvapH (kJ/mol) | Temperature (K) | Method | Reference | Comment |
---|---|---|---|---|
95.2 | 495. | A,MG | Stephenson and Malanowski, 1987 | Based on data from 480. to 516. K. See also Schiessler and Whitmore, 1955.; AC |

References

Anonymous, 1968
Anonymous, R.,
Properties of hydrocarbon of high molecular weight, Am. Pet. Inst. Res. Proj. 42, Penn. State Univ., 1968. [all data]
Stephenson and Malanowski, 1987
Stephenson, Richard M.; Malanowski, Stanislaw,
Handbook of the Thermodynamics of Organic Compounds, 1987, https://doi.org/10.1007/978-94-009-3173-2
. [all data]
Schiessler and Whitmore, 1955
Schiessler, R.W.; Whitmore, F.C.,
Properties of High Molecular Weight Hydrocarbons,
Ind. Eng. Chem., 1955, 47, 8, 1660-1665, https://doi.org/10.1021/ie50548a054
. [all data]