Dodecane, 1-cyclopentyl-4-(3-cyclopentylpropyl)-
- Formula: C25H48
- Molecular weight: 348.6486
- IUPAC Standard InChIKey: ZMXUNXRABSSJDU-UHFFFAOYSA-N
- CAS Registry Number: 7225-68-5
- Chemical structure:
View 3d structure (requires JavaScript / HTML 5) - Other names: 1,7-Dicyclopentyl-4-n-octylheptane; Cyclopentane, 1,1'-(4-octyl-1,7-heptanediyl)bis-; 1-Cyclopentyl-4-(3-cyclopentylpropyl)dodecane

Phase change data

Data compiled as indicated in comments:
TRC - Thermodynamics Research Center, NIST Boulder Laboratories, Chris Muzny director
AC - William E. Acree, Jr., James S. Chickos
Quantity | Value | Units | Method | Reference | Comment |
---|---|---|---|---|---|
Tfus | 233.15 | K | N/A | Anonymous, 1968 | Uncertainty assigned by TRC = 2. K; TRC |
Tfus | 233. | K | N/A | Foehr and Fenske, 1949 | Uncertainty assigned by TRC = 3. K; TRC |
Tfus | 233. | K | N/A | Schiessler, 1947 | Uncertainty assigned by TRC = 8. K; TRC |
Enthalpy of vaporization
ΔvapH (kJ/mol) | Temperature (K) | Method | Reference | Comment |
---|---|---|---|---|
88.5 | 495. | A,MG | Stephenson and Malanowski, 1987 | Based on data from 480. to 518. K. See also Schiessler and Whitmore, 1955.; AC |

References

Anonymous, 1968
Anonymous, R.,
Properties of hydrocarbon of high molecular weight, Am. Pet. Inst. Res. Proj. 42, Penn. State Univ., 1968. [all data]
Foehr and Fenske, 1949
Foehr, E.G.; Fenske, M.R.,
Magneto-optic Rotation of Hydrocarbons,
Ind. Eng. Chem., 1949, 41, 1956. [all data]
Schiessler, 1947
Schiessler, R.W.,
, Am. Pet. Inst. Res. Proj. 42, Twelfth Meeting, 1947. [all data]
Stephenson and Malanowski, 1987
Stephenson, Richard M.; Malanowski, Stanislaw,
Handbook of the Thermodynamics of Organic Compounds, 1987, https://doi.org/10.1007/978-94-009-3173-2
. [all data]
Schiessler and Whitmore, 1955
Schiessler, R.W.; Whitmore, F.C.,
Properties of High Molecular Weight Hydrocarbons,
Ind. Eng. Chem., 1955, 47, 8, 1660-1665, https://doi.org/10.1021/ie50548a054
. [all data]