Benzenethiol, 2-methoxy-
- Formula: C7H8OS
- Molecular weight: 140.203
- IUPAC Standard InChIKey: DSCJETUEDFKYGN-UHFFFAOYSA-N
- CAS Registry Number: 7217-59-6
- Chemical structure:
View 3d structure (requires JavaScript / HTML 5) - Other names: 2-Methoxybenzenethiol; 2-Methoxythiophenol; o-Methoxythiophenol; Benzenethiol, o-methoxy-; o-Methoxybenzenethiol; Thioguaiacol

Phase change data

Data compiled by: Robert L. Brown and Stephen E. Stein
Reduced pressure boiling point
Tboil (K) | Pressure (bar) | Reference |
---|---|---|
372.2 | 0.01 | Aldrich Chemical Company Inc., 1990 |

Van Den Dool and Kratz RI, non-polar column, custom temperature program

Column type | Active phase | I | Reference | Comment |
---|---|---|---|---|
Capillary | VF-5MS | 1237.2 | Tret'yakov, 2008 | 30. m/0.25 mm/0.25 μm, He; Program: Multi-step temperature program; T(initial)=60C; T(final)=270C |

References

Aldrich Chemical Company Inc., 1990
Aldrich Chemical Company Inc.,
Catalog Handbook of Fine Chemicals, Aldrich Chemical Company, Inc., Milwaukee WI, 1990, 1. [all data]
Tret'yakov, 2008
Tret'yakov, K.V.,
Retention Data. NIST Mass Spectrometry Data Center., NIST Mass Spectrometry Data Center, 2008. [all data]