D-Glucitol, hexaacetate
- Formula: C18H26O12
- Molecular weight: 434.3918
- IUPAC Standard InChIKey: NJVBTKVPPOFGAT-UHFFFAOYSA-N
- CAS Registry Number: 7208-47-1
- Chemical structure:
- Stereoisomers:
- Other names: Glucitol, hexaacetate, D-; Hexa-O-acetylglucitol; Sorbitol hexaacetate; D-Sorbitol hexaacetate; Hexaacetylsorbitol; Glucitol hexaacetate; hexa-O-acetyl-D-glucitol

Phase change data

Data compiled by: Thermodynamics Research Center, NIST Boulder Laboratories, Chris Muzny director
Quantity | Value | Units | Method | Reference | Comment |
---|---|---|---|---|---|
Tfus | 372. | K | N/A | Dunbar and Bolstad, 1956 | Uncertainty assigned by TRC = 3. K |

References

Dunbar and Bolstad, 1956
Dunbar, R.E.; Bolstad, L.L.,
The Acetylation of Organic Hydroxy Compounds with Ketene,
J. Org. Chem., 1956, 21, 1041. [all data]