Propanediamide, 2-ethyl-2-phenyl-
- Formula: C11H14N2O2
- Molecular weight: 206.2411
- IUPAC Standard InChIKey: JFZHPFOXAAIUMB-UHFFFAOYSA-N
- CAS Registry Number: 7206-76-0
- Chemical structure:
View 3d structure (requires JavaScript / HTML 5) - Other names: Malonamide, 2-ethyl-2-phenyl-; Ethylphenylmalondiamide; Phenylethylmalonamide; Phenylethylmalondiamide; 2-Ethyl-2-phenylmalondiamide; 2-Ethyl-2-phenylmalonamide; 2-Ethyl-2-phenylmalonic diamide; PEMA; PEMA (amide); 80866-90-6 (hydrate); Primidone, M(diamide); 2-ethyl-2-phenylmalonamide monohydrate

Kovats' RI, non-polar column, isothermal

Column type | Active phase | Temperature (C) | I | Reference | Comment |
---|---|---|---|---|---|
Capillary | DB-5 | 220. | 1916. | Phillips, Logan, et al., 1990 | 15. m/0.25 mm/0.2 μm, He |

Kovats' RI, non-polar column, temperature ramp

Column type | Active phase | I | Reference | Comment |
---|---|---|---|---|
Packed | OV-101 | 1935. | Maurer, 1990 | N2, Chromosorb G HP, 100. C @ 3. min, 30. K/min, 310. C @ 5. min; Column length: 0.6 m |

References

Phillips, Logan, et al., 1990
Phillips, A.M.; Logan, B.K.; Stafford, D.T.,
Further applications for capillary gas chromatography in routine quantitative toxicological analyses,
J. Hi. Res. Chromatogr., 1990, 13, 11, 754-758, https://doi.org/10.1002/jhrc.1240131106
. [all data]
Maurer, 1990
Maurer, H.H.,
Detection of anticonvulsants and their metabolites in urine within a general unknown analysis procedure using computerized gas chromatography-mass spectrometry,
Arch. Toxicol., 1990, 64, 7, 554-561, https://doi.org/10.1007/BF01971834
. [all data]