9-Octadecene, (E)-
- Formula: C18H36
- Molecular weight: 252.4784
- IUPAC Standard InChIKey: HSNQNPCNYIJJHT-ISLYRVAYSA-N
- CAS Registry Number: 7206-25-9
- Chemical structure:
View 3d structure (requires JavaScript / HTML 5) - Stereoisomers:
- Other names: (9E)-9-Octadecene; (E)-9-Octadecene; trans-9-Octadecene

Phase change data

Data compiled by: Thermodynamics Research Center, NIST Boulder Laboratories, Chris Muzny director
Quantity | Value | Units | Method | Reference | Comment |
---|---|---|---|---|---|
Tfus | 278.2 | K | N/A | Elsner and Paul, 1953 | Uncertainty assigned by TRC = 2. K |
Tfus | 275.15 | K | N/A | Boeseken and Belinfante, 1926 | Uncertainty assigned by TRC = 3. K |

Kovats' RI, polar column, isothermal

Column type | Active phase | Temperature (C) | I | Reference | Comment |
---|---|---|---|---|---|
Capillary | PEG-20M | 110. | 1803. | Rang, Orav, et al., 1988 | |
Capillary | Carbowax 20M | 110. | 1803.3 | Soják, Krupcík, et al., 1980 | N2; Column length: 300. m; Column diameter: 0.25 mm |

References

Elsner and Paul, 1953
Elsner, B.B.; Paul, P.F.M.,
J. Chem. Soc., 1953, 1953, 3156. [all data]
Boeseken and Belinfante, 1926
Boeseken, J.; Belinfante, A.H.,
The Configuration of Oleic and Elaidic Acids,
Recl. Trav. Chim. Pays-Bas, 1926, 45, 914. [all data]
Rang, Orav, et al., 1988
Rang, S.A.; Orav, A.E.; Kuningas, K.R.; Meister, A.E.; Strense, T.V.; Eisen, O.G.,
Gas-Chromatographic Characteristics of unsaturated hydrocarbons, Academy of Sciences of Estonia SSR, Tallinn, Estonia SSR, 1988, 208. [all data]
Soják, Krupcík, et al., 1980
Soják, L.; Krupcík, J.; Janák, J.,
Gas chromatography of all C15-C18 linear alkenes on capillary columns with very high resolution power,
J. Chromatogr., 1980, 195, 1, 43-64, https://doi.org/10.1016/S0021-9673(00)81542-3
. [all data]