(E)-6-octadecene
- Formula: C18H36
- Molecular weight: 252.4784
- IUPAC Standard InChIKey: HPDAWHPYUNZJMN-ACCUITESSA-N
- CAS Registry Number: 7206-22-6
- Chemical structure:
View 3d structure (requires JavaScript / HTML 5) - Species with the same structure:
- Stereoisomers:

Phase change data

Data compiled by: Thermodynamics Research Center, NIST Boulder Laboratories, Chris Muzny director
Quantity | Value | Units | Method | Reference | Comment |
---|---|---|---|---|---|
Tfus | 273.75 | K | N/A | Elsner and Paul, 1953 | Uncertainty assigned by TRC = 2. K |

References

Elsner and Paul, 1953
Elsner, B.B.; Paul, P.F.M.,
J. Chem. Soc., 1953, 1953, 3156. [all data]