5-Dodecene, (E)-
- Formula: C12H24
- Molecular weight: 168.3190
- IUPAC Standard InChIKey: ZOKYTRIEIDWYSG-PKNBQFBNSA-N
- CAS Registry Number: 7206-16-8
- Chemical structure:
View 3d structure (requires JavaScript / HTML 5) - Stereoisomers:
- Other names: (5E)-5-Dodecene; (E)-5-Dodecene; trans-5-Dodecene

Kovats' RI, non-polar column, isothermal

Column type | Active phase | Temperature (C) | I | Reference | Comment |
---|---|---|---|---|---|
Capillary | Squalane | 100. | 1181. | Heinzen, Soares, et al., 1999 | |
Capillary | SE-30 | 120. | 1189. | Gusev, Sokolov, et al., 1989 | H2; Column length: 40. m; Column diameter: 0.30 mm |
Capillary | OV-101 | 110. | 1188. | Rang, Kuningas, et al., 1987 | He; Column length: 50. m; Column diameter: 0.25 mm |
Capillary | Squalane | 100. | 1181. | Sojak, Hrivnak, et al., 1973 | |
Capillary | Squalane | 115. | 1181. | Sojak, Hrivnak, et al., 1973 | |
Capillary | Squalane | 130. | 1182. | Sojak, Hrivnak, et al., 1973 | |
Capillary | Squalane | 86. | 1180. | Sojak, Hrivnak, et al., 1973 | |
Capillary | Apiezon L | 120. | 1182.2 | Eisen, Orav, et al., 1972 | Column length: 45. m; Column diameter: 0.25 mm |
Capillary | Squalane | 100. | 1180.6 | Soják and Hrivnák, 1972 | H2; Column length: 200. m; Column diameter: 0.2 mm |
Capillary | Squalane | 115. | 1181.1 | Soják and Hrivnák, 1972 | H2; Column length: 200. m; Column diameter: 0.2 mm |
Capillary | Squalane | 130. | 1181.6 | Soják and Hrivnák, 1972 | H2; Column length: 200. m; Column diameter: 0.2 mm |
Capillary | Squalane | 86. | 1179.8 | Soják and Hrivnák, 1972 | H2; Column length: 200. m; Column diameter: 0.2 mm |

Kovats' RI, polar column, isothermal

Column type | Active phase | Temperature (C) | I | Reference | Comment |
---|---|---|---|---|---|
Capillary | PEG 4000 | 100. | 1237. | Rang, Orav, et al., 1988 | |
Capillary | PEG 4000 | 110. | 1238. | Rang, Orav, et al., 1988 | |
Capillary | PEG 4000 | 120. | 1238. | Rang, Orav, et al., 1988 | |
Capillary | PEG 4000 | 140. | 1239. | Rang, Orav, et al., 1988 | |
Capillary | PEG 4000 | 160. | 1240. | Rang, Orav, et al., 1988 | |
Capillary | PEG-20M | 100. | 1232. | Rang, Orav, et al., 1988 | |
Capillary | PEG-20M | 110. | 1232. | Rang, Orav, et al., 1988 | |
Capillary | PEG-20M | 120. | 1232. | Rang, Orav, et al., 1988 | |
Capillary | PEG-20M | 130. | 1233. | Rang, Orav, et al., 1988 | |
Capillary | PEG-20M | 140. | 1234. | Rang, Orav, et al., 1988 | |
Capillary | PEG-20M | 90. | 1231. | Rang, Orav, et al., 1988 | |
Capillary | PEG 4000 | 100. | 1237. | Rang, Kuningas, et al., 1977 | Column diameter: 0.25 mm |
Capillary | PEG 4000 | 120. | 1238. | Rang, Kuningas, et al., 1977 | Column diameter: 0.25 mm |
Capillary | PEG 4000 | 140. | 1239. | Rang, Kuningas, et al., 1977 | Column diameter: 0.25 mm |
Capillary | PEG 4000 | 160. | 1240. | Rang, Kuningas, et al., 1977 | Column diameter: 0.25 mm |
Capillary | Polyethylene Glycol 4000 | 100. | 1239.4 | Eisen, Orav, et al., 1972 | Column length: 80. m; Column diameter: 0.25 mm |
Capillary | Polyethylene Glycol 4000 | 120. | 1239.8 | Eisen, Orav, et al., 1972 | Column length: 80. m; Column diameter: 0.25 mm |
Capillary | PEG 4000 | 100. | 1239.4 | Orav and Eisen, 1972 | Column length: 80. m; Column diameter: 0.25 mm |
Capillary | PEG 4000 | 120. | 1239.8 | Orav and Eisen, 1972 | Column length: 80. m; Column diameter: 0.25 mm |

Normal alkane RI, non-polar column, custom temperature program

Column type | Active phase | I | Reference | Comment |
---|---|---|---|---|
Capillary | Polydimethyl siloxane | 1181. | Junkes, Castanho, et al., 2003 | Program: not specified |

References

Heinzen, Soares, et al., 1999
Heinzen, V.E.F.; Soares, M.F.; Yunes, R.A.,
Semi-empirical topological method for the prediction of the chromatographic retention of cis- and trans-alkene isomers and alkanes,
J. Chromatogr. A, 1999, 849, 2, 495-506, https://doi.org/10.1016/S0021-9673(99)00530-0
. [all data]
Gusev, Sokolov, et al., 1989
Gusev, G.M.; Sokolov, V.P.; Yurov, V.V.; Kuznetsov, A.V.; Potatuev, A.A.,
Identification of olefins during hydrocarboxylation,
Zh. Anal. Khim., 1989, 44, 551-555. [all data]
Rang, Kuningas, et al., 1987
Rang, S.; Kuningas, K.; Strenze, T.; Orav, A.; Eisen, O.,
Retention and Thermodynamics of Solution of n-Alkenes in OV-101,
J. Chromatogr., 1987, 406, 75-80, https://doi.org/10.1016/S0021-9673(00)94018-4
. [all data]
Sojak, Hrivnak, et al., 1973
Sojak, L.; Hrivnak, J.; Majer, P.; Janak, J.,
Capillary Gas Chromatography of Linear Alkenes on Squalane,
Anal. Chem., 1973, 45, 2, 293-302, https://doi.org/10.1021/ac60324a039
. [all data]
Eisen, Orav, et al., 1972
Eisen, O.; Orav, A.; Rang, S.,
Identifizierung von Normal-Alkenen, Cyclopentenen und -Hexenen mittels Kapillar-Gas-Chromatographie. Identification des alcènes, cyclopentènes et -hexènes à l'aide de la chromatogrpahie en phase gazeuse sur colonne capillaire,
Chromatographia, 1972, 5, 11, 229-239, https://doi.org/10.1007/BF02270600
. [all data]
Soják and Hrivnák, 1972
Soják, L.; Hrivnák, J.,
Open tubular column gas chromatography of the catalytic dehydrogenation products of n-dodecane,
J. Chromatogr. Sci., 1972, 10, 11, 701-704, https://doi.org/10.1093/chromsci/10.11.701
. [all data]
Rang, Orav, et al., 1988
Rang, S.A.; Orav, A.E.; Kuningas, K.R.; Meister, A.E.; Strense, T.V.; Eisen, O.G.,
Gas-Chromatographic Characteristics of unsaturated hydrocarbons, Academy of Sciences of Estonia SSR, Tallinn, Estonia SSR, 1988, 208. [all data]
Rang, Kuningas, et al., 1977
Rang, S.; Kuningas, K.; Orav, A.; Eisen, O.,
Capillary Gas Chromatography of C6-C14 n-Alkenes on Polyphenyl Ether and Polyethylene Glycol 4000,
Chromatographia, 1977, 10, 2, 55-64, https://doi.org/10.1007/BF02274460
. [all data]
Orav and Eisen, 1972
Orav, A.; Eisen, O.,
The retention indexes for alkenes, alkynes and cyclenes on capillary columns,
Izv. Akad. Nauk Est. SSR, Khim. Geol., 1972, 21, 1, 39-47. [all data]
Junkes, Castanho, et al., 2003
Junkes, B.S.; Castanho, R.D.M.; Amboni, C.; Yunes, R.A.; Heinzen, V.E.F.,
Semiempirical Topological Index: A Novel Molecular Descriptor for Quantitative Structure-Retention Relationship Studies,
Internet Electronic Journal of Molecular Design, 2003, 2, 1, 33-49. [all data]