3-Dodecene, (E)-
- Formula: C12H24
- Molecular weight: 168.3190
- IUPAC Standard InChIKey: WLTSXAIICPDFKI-FNORWQNLSA-N
- CAS Registry Number: 7206-14-6
- Chemical structure:
View 3d structure (requires JavaScript / HTML 5) - Stereoisomers:
- Other names: trans-3-Dodecene; (3E)-3-Dodecene; (E)-3-Dodecene

Kovats' RI, non-polar column, isothermal

Column type | Active phase | Temperature (C) | I | Reference | Comment |
---|---|---|---|---|---|
Capillary | Squalane | 100. | 1185. | Heinzen, Soares, et al., 1999 | |
Capillary | SE-30 | 120. | 1193. | Gusev, Sokolov, et al., 1989 | H2; Column length: 40. m; Column diameter: 0.30 mm |
Capillary | SE-30 | 120. | 1193. | Gusev, Sokolov, et al., 1989 | H2; Column length: 40. m; Column diameter: 0.30 mm |
Capillary | OV-101 | 110. | 1193. | Rang, Kuningas, et al., 1987 | He; Column length: 50. m; Column diameter: 0.25 mm |
Capillary | Squalane | 100. | 1185. | Sojak, Hrivnak, et al., 1973 | |
Capillary | Squalane | 115. | 1185. | Sojak, Hrivnak, et al., 1973 | |
Capillary | Squalane | 130. | 1185. | Sojak, Hrivnak, et al., 1973 | |
Capillary | Squalane | 86. | 1185. | Sojak, Hrivnak, et al., 1973 | |
Capillary | Squalane | 100. | 1185.1 | Soják and Hrivnák, 1972 | H2; Column length: 200. m; Column diameter: 0.2 mm |
Capillary | Squalane | 115. | 1185.2 | Soják and Hrivnák, 1972 | H2; Column length: 200. m; Column diameter: 0.2 mm |
Capillary | Squalane | 130. | 1185.3 | Soják and Hrivnák, 1972 | H2; Column length: 200. m; Column diameter: 0.2 mm |
Capillary | Squalane | 86. | 1185.0 | Soják and Hrivnák, 1972 | H2; Column length: 200. m; Column diameter: 0.2 mm |

Kovats' RI, polar column, isothermal

Column type | Active phase | Temperature (C) | I | Reference | Comment |
---|---|---|---|---|---|
Capillary | PEG 4000 | 100. | 1246. | Rang, Orav, et al., 1988 | |
Capillary | PEG 4000 | 110. | 1246. | Rang, Orav, et al., 1988 | |
Capillary | PEG 4000 | 120. | 1246. | Rang, Orav, et al., 1988 | |
Capillary | PEG 4000 | 140. | 1246. | Rang, Orav, et al., 1988 | |
Capillary | PEG 4000 | 160. | 1246. | Rang, Orav, et al., 1988 | |
Capillary | PEG-20M | 100. | 1241. | Rang, Orav, et al., 1988 | |
Capillary | PEG-20M | 110. | 1241. | Rang, Orav, et al., 1988 | |
Capillary | PEG-20M | 120. | 1241. | Rang, Orav, et al., 1988 | |
Capillary | PEG-20M | 130. | 1241. | Rang, Orav, et al., 1988 | |
Capillary | PEG-20M | 140. | 1241. | Rang, Orav, et al., 1988 | |
Capillary | PEG-20M | 90. | 1240. | Rang, Orav, et al., 1988 | |
Capillary | PEG 4000 | 100. | 1246. | Rang, Kuningas, et al., 1977 | Column diameter: 0.25 mm |
Capillary | PEG 4000 | 120. | 1246. | Rang, Kuningas, et al., 1977 | Column diameter: 0.25 mm |
Capillary | PEG 4000 | 140. | 1246. | Rang, Kuningas, et al., 1977 | Column diameter: 0.25 mm |
Capillary | PEG 4000 | 160. | 1246. | Rang, Kuningas, et al., 1977 | Column diameter: 0.25 mm |

Kovats' RI, polar column, temperature ramp

Column type | Active phase | I | Reference | Comment |
---|---|---|---|---|
Capillary | DB-Wax | 1237. | Umano and Shibamoto, 1987 | He, 40. C @ 10. min, 2. K/min; Column length: 60. m; Column diameter: 0.25 mm; Tend: 200. C |

Normal alkane RI, non-polar column, custom temperature program

Column type | Active phase | I | Reference | Comment |
---|---|---|---|---|
Capillary | Polydimethyl siloxane | 1185. | Junkes, Castanho, et al., 2003 | Program: not specified |

References

Heinzen, Soares, et al., 1999
Heinzen, V.E.F.; Soares, M.F.; Yunes, R.A.,
Semi-empirical topological method for the prediction of the chromatographic retention of cis- and trans-alkene isomers and alkanes,
J. Chromatogr. A, 1999, 849, 2, 495-506, https://doi.org/10.1016/S0021-9673(99)00530-0
. [all data]
Gusev, Sokolov, et al., 1989
Gusev, G.M.; Sokolov, V.P.; Yurov, V.V.; Kuznetsov, A.V.; Potatuev, A.A.,
Identification of olefins during hydrocarboxylation,
Zh. Anal. Khim., 1989, 44, 551-555. [all data]
Rang, Kuningas, et al., 1987
Rang, S.; Kuningas, K.; Strenze, T.; Orav, A.; Eisen, O.,
Retention and Thermodynamics of Solution of n-Alkenes in OV-101,
J. Chromatogr., 1987, 406, 75-80, https://doi.org/10.1016/S0021-9673(00)94018-4
. [all data]
Sojak, Hrivnak, et al., 1973
Sojak, L.; Hrivnak, J.; Majer, P.; Janak, J.,
Capillary Gas Chromatography of Linear Alkenes on Squalane,
Anal. Chem., 1973, 45, 2, 293-302, https://doi.org/10.1021/ac60324a039
. [all data]
Soják and Hrivnák, 1972
Soják, L.; Hrivnák, J.,
Open tubular column gas chromatography of the catalytic dehydrogenation products of n-dodecane,
J. Chromatogr. Sci., 1972, 10, 11, 701-704, https://doi.org/10.1093/chromsci/10.11.701
. [all data]
Rang, Orav, et al., 1988
Rang, S.A.; Orav, A.E.; Kuningas, K.R.; Meister, A.E.; Strense, T.V.; Eisen, O.G.,
Gas-Chromatographic Characteristics of unsaturated hydrocarbons, Academy of Sciences of Estonia SSR, Tallinn, Estonia SSR, 1988, 208. [all data]
Rang, Kuningas, et al., 1977
Rang, S.; Kuningas, K.; Orav, A.; Eisen, O.,
Capillary Gas Chromatography of C6-C14 n-Alkenes on Polyphenyl Ether and Polyethylene Glycol 4000,
Chromatographia, 1977, 10, 2, 55-64, https://doi.org/10.1007/BF02274460
. [all data]
Umano and Shibamoto, 1987
Umano, K.; Shibamoto, T.,
Analysis of headspace volatiles from overheated beef fat,
J. Agric. Food Chem., 1987, 35, 1, 14-18, https://doi.org/10.1021/jf00073a004
. [all data]
Junkes, Castanho, et al., 2003
Junkes, B.S.; Castanho, R.D.M.; Amboni, C.; Yunes, R.A.; Heinzen, V.E.F.,
Semiempirical Topological Index: A Novel Molecular Descriptor for Quantitative Structure-Retention Relationship Studies,
Internet Electronic Journal of Molecular Design, 2003, 2, 1, 33-49. [all data]