Cyheptamide
- Formula: C16H15NO
- Molecular weight: 237.2964
- IUPAC Standard InChIKey: APBVLLORZMAWKI-UHFFFAOYSA-N
- CAS Registry Number: 7199-29-3
- Chemical structure:
View 3d structure (requires JavaScript / HTML 5) - Other names: 5H-Dibenzo[a,d]cycloheptene-5-carboxamide, 10,11-dihydro-; AY 8682; BS 7029; Cyheptamine; Dibenzo(a,d)cycloheptadiene-5-carboxamide; Dibenzo(a,d)(1,4)-cycloheptadiene-5-carboxamide; 10,11-Dihydro-5H-dibenzo(a,d)cycloheptene-5-carboxamide; ICI 51426; Carbamazepam; Cyhetamide

Van Den Dool and Kratz RI, non-polar column, custom temperature program

Column type | Active phase | I | Reference | Comment |
---|---|---|---|---|
Capillary | VF-5MS | 2358.8 | Tret'yakov, 2008 | 30. m/0.25 mm/0.25 μm, He; Program: Multi-step temperature program; T(initial)=60C; T(final)=270C |

Normal alkane RI, non-polar column, custom temperature program

Column type | Active phase | I | Reference | Comment |
---|---|---|---|---|
Other | Methyl Silicone | 2266. | Ardrey and Moffat, 1981 | Program: not specified |

References

Tret'yakov, 2008
Tret'yakov, K.V.,
Retention Data. NIST Mass Spectrometry Data Center., NIST Mass Spectrometry Data Center, 2008. [all data]
Ardrey and Moffat, 1981
Ardrey, R.E.; Moffat, A.C.,
Gas-liquid chromatographic retention indices of 1318 substances of toxicological interest on SE-30 or OV-1 stationary phase,
J. Chromatogr., 1981, 220, 3, 195-252, https://doi.org/10.1016/S0021-9673(00)81925-1
. [all data]