Benzene, 1,1'-butylidenebis-
- Formula: C16H18
- Molecular weight: 210.3141
- IUPAC Standard InChIKey: SZFDQMKAGLCYPA-UHFFFAOYSA-N
- CAS Registry Number: 719-79-9
- Chemical structure:
View 3d structure (requires JavaScript / HTML 5) - Other names: 1,1-Diphenylbutane

Phase change data

Data compiled as indicated in comments:
BS - Robert L. Brown and Stephen E. Stein
TRC - Thermodynamics Research Center, NIST Boulder Laboratories, Chris Muzny director
AC - William E. Acree, Jr., James S. Chickos
Quantity | Value | Units | Method | Reference | Comment |
---|---|---|---|---|---|
Tboil | 560.2 | K | N/A | Weast and Grasselli, 1989 | BS |
Tboil | 568.44 | K | N/A | Serijan and Wise, 1952 | Uncertainty assigned by TRC = 0.2 K; TRC |
Tboil | 567.44 | K | N/A | Wise, Serijan, et al., 1950 | Uncertainty assigned by TRC = 0.5 K; TRC |
Tboil | 560. | K | N/A | Sabatier and Murat, 1915 | Uncertainty assigned by TRC = 4. K; TRC |
Tboil | 560. | K | N/A | Sabatier and Murat, 1913 | Uncertainty assigned by TRC = 4. K; TRC |
Quantity | Value | Units | Method | Reference | Comment |
Tfus | 248.0 | K | N/A | Serijan and Wise, 1952 | Uncertainty assigned by TRC = 0.3 K; TRC |
Quantity | Value | Units | Method | Reference | Comment |
ΔvapH° | 77.2 ± 0.6 | kJ/mol | GS | Verevkin, 1999 | Based on data from 298. to 342. K.; AC |
Enthalpy of vaporization
ΔvapH (kJ/mol) | Temperature (K) | Method | Reference | Comment |
---|---|---|---|---|
75.9 ± 0.6 | 320. | GS | Verevkin, 1999 | Based on data from 298. to 342. K.; AC |

References

Weast and Grasselli, 1989
CRC Handbook of Data on Organic Compounds, 2nd Editon, Weast,R.C and Grasselli, J.G., ed(s)., CRC Press, Inc., Boca Raton, FL, 1989, 1. [all data]
Serijan and Wise, 1952
Serijan, K.T.; Wise, P.H.,
Dicyclic hydrocarbons. V. Synthesis and physical properties of the diphenyl - and dicyclohexylbutanes,
J. Am. Chem. Soc., 1952, 74, 365-8. [all data]
Wise, Serijan, et al., 1950
Wise, P.H.; Serijan, K.T.; Goodman, I.A.,
Correlation of Physical Properties with Molecular Structre for Dicyclic Hydrocarbons. I. 2-n-Alakylbiphenyl-1,1-alkane, α,ω-dicyclohexylalkane Series, Nat. Advis. Comm. Aeronaut., Tech. Notes, No. 2081, Lewis Flight Propulsion Lab., Cleveland, OH, 1950. [all data]
Sabatier and Murat, 1915
Sabatier, P.; Murat, M.,
Ann. Chim. (Paris), 1915, 4, 253. [all data]
Sabatier and Murat, 1913
Sabatier, P.; Murat, M.,
C. R. Hebd. Seances Acad. Sci., 1913, 156, 1430. [all data]
Verevkin, 1999
Verevkin, Sergey P.,
Thermochemical Properties of Diphenylalkanes,
J. Chem. Eng. Data, 1999, 44, 2, 175-179, https://doi.org/10.1021/je980200e
. [all data]