1,2-dihydro-4-(2-phenylethyl)naphthalene
- Formula: C18H18
- Molecular weight: 234.3355
- IUPAC Standard InChIKey: HUPXZSXWWFONOB-UHFFFAOYSA-N
- CAS Registry Number: 71912-48-6
- Chemical structure:
View 3d structure (requires JavaScript / HTML 5) - Permanent link for this species. Use this link for bookmarking this species for future reference.

Phase change data

Data compiled by: Thermodynamics Research Center, NIST Boulder Laboratories, Chris Muzny director
Quantity | Value | Units | Method | Reference | Comment |
---|---|---|---|---|---|
Tfus | 327. | K | N/A | Mills and Schofield, 1956 | Uncertainty assigned by TRC = 4. K |

References

Mills and Schofield, 1956
Mills, B.; Schofield, K.,
Synthesis of 3,4- and 5,6-Dibenzoanthridines,
J. Chem. Soc., 1956, 1956, 4213-24. [all data]