p-Nitrobenzylidene tert-butylamine

Phase change data

Data compiled as indicated in comments:
ALS - Hussein Y. Afeefy, Joel F. Liebman, and Stephen E. Stein
AC - William E. Acree, Jr., James S. Chickos

Quantity Value Units Method Reference Comment
Δsub91.1 ± 3.1kJ/molCAcree, Kirchner, et al., 1989ALS
Δsub91.1 ± 3.1kJ/molCAcree, Kirchner, et al., 1989AC

References

Acree, Kirchner, et al., 1989
Acree, W.E., Jr.; Kirchner, J.J.; Tucker, S.A., Enthalpies of combustion of three benzylidene t-butylamine N-oxide derivatives and of 4-nitrobenxylidene t-butylamine: the dissociation enthalpies of the (N-O) bonds, J. Chem. Thermodyn., 1989, 21, 443-448. [all data]