1-Trimethylsilyl-1,4-pentadiyne
- Formula: C8H12Si
- Molecular weight: 136.2664
- IUPAC Standard InChIKey: JKYMNPFNLMDSFG-UHFFFAOYSA-N
- CAS Registry Number: 71789-10-1
- Chemical structure:
View 3d structure (requires JavaScript / HTML 5) - Permanent link for this species. Use this link for bookmarking this species for future reference.

Phase change data

Data compiled by: Robert L. Brown and Stephen E. Stein
Reduced pressure boiling point
Tboil (K) | Pressure (bar) | Reference |
---|---|---|
315. | 0.033 | Farchan Laboratories, 1990 |

References

Farchan Laboratories, 1990
Farchan Laboratories,
Research Chemicals Catalog, Farchan Laboratories, Gainesville, FL, 1990, 91. [all data]