Propane, 1-chloro-3-((2-chloroethyl)thio)-
- Formula: C5H10Cl2S
- Molecular weight: 173.104
- IUPAC Standard InChIKey: NXRPRUPNFDEDSY-UHFFFAOYSA-N
- CAS Registry Number: 71784-01-5
- Chemical structure:
View 3d structure (requires JavaScript / HTML 5) - Other names: 1-Chloro-3-((2-chloroethyl)thio)propane; 2-Chloroethyl-3-chloropropyl sulfide

Van Den Dool and Kratz RI, non-polar column, temperature ramp

Column type | Active phase | I | Reference | Comment |
---|---|---|---|---|
Capillary | OV-1 | 1169. | Kostiainen, 2000 | 15. m/0.32 mm/0.25 μm, He, 50. C @ 2. min, 10. K/min, 280. C @ 10. min |
Capillary | SE-54 | 1212.6 | Kostiainen, 2000 | 25. m/0.32 mm/0.25 μm, He, 40. C @ 1. min, 10. K/min, 280. C @ 10. min |
Capillary | DB-1 | 1169. | D'agostino and Provost, 1988 | 15. m/0.32 mm/0.25 μm, He, 50. C @ 2. min, 10. K/min, 300. C @ 5. min |
Capillary | DB-5 | 1212.6 | D'agostino and Provost, 1988 | 15. m/0.32 mm/0.25 μm, 50. C @ 2. min, 10. K/min, 300. C @ 5. min |

Normal alkane RI, non-polar column, temperature ramp

Column type | Active phase | I | Reference | Comment |
---|---|---|---|---|
Capillary | HP-5 | 1174. | Mazurek, Witkiewicz, et al., 2001 | He, 40. C @ 3. min, 10. K/min, 280. C @ 30. min; Column length: 30. m; Column diameter: 0.32 mm |

References

Kostiainen, 2000
Kostiainen, O.,
Gas Chromatography in Screening of Chemicals Related to the Chemical Weapons Convention
in Encyclopedia of Analytical Chemistry, Meyers, R.A., ed(s)., John Wiley Sons Ltd, Chichester, 2000, 963-979. [all data]
D'agostino and Provost, 1988
D'agostino, P.A.; Provost, L.R.,
Gas chromatographic retention indices of sulphur vesicants and related compounds,
J. Chromatogr., 1988, 436, 399-411, https://doi.org/10.1016/S0021-9673(00)94599-0
. [all data]
Mazurek, Witkiewicz, et al., 2001
Mazurek, M.; Witkiewicz, Z.; Popiel, S.; Sliwakowski, M.,
Capillary gas chromatography-atomic emission spectroscopy-mass spectrometry analysis of sulphur mustard and transformation products in a block recovered from the Baltic Sea,
J. Chromatogr. A, 2001, 919, 1, 133-145, https://doi.org/10.1016/S0021-9673(01)00672-0
. [all data]