Fe(CO) anion
- Formula: CFeO-
- Molecular weight: 83.856
- CAS Registry Number: 71765-17-8

Gas phase thermochemistry data

Data compiled by: John E. Bartmess
Quantity | Value | Units | Method | Reference | Comment |
---|---|---|---|---|---|
ΔfH°gas | 146. ± 15. | kJ/mol | R-EA | Villalta and Leopold, 1993 | |
ΔfH°gas | 68. ± 25. | kJ/mol | EIAE | Compton and Stockdale, 1976 | From Fe(CO)5 |

Ion clustering data

Data compiled by: John E. Bartmess
Clustering reactions
(CFeO- • 4294967295) +
= CFeO-
By formula: (CFeO- • 4294967295CO) + CO = CFeO-
Quantity | Value | Units | Method | Reference | Comment |
---|---|---|---|---|---|
ΔrH° | 146. ± 15. | kJ/mol | N/A | Villalta and Leopold, 1993 | gas phase |
ΔrH° | 141. ± 15. | kJ/mol | CIDT | Sunderlin, Wang, et al., 1992 | gas phase |

Reaction thermochemistry data

Data compiled by: John E. Bartmess
Individual Reactions
(CFeO- • 4294967295) +
= CFeO-
By formula: (CFeO- • 4294967295CO) + CO = CFeO-
Quantity | Value | Units | Method | Reference | Comment |
---|---|---|---|---|---|
ΔrH° | 146. ± 15. | kJ/mol | N/A | Villalta and Leopold, 1993 | gas phase |
ΔrH° | 141. ± 15. | kJ/mol | CIDT | Sunderlin, Wang, et al., 1992 | gas phase |

References

Villalta and Leopold, 1993
Villalta, P.W.; Leopold, D.G.,
A Study of FeCO- and the 3-Sigma(-) and 5-Sigma(-) States of FeCO by Negative Ion Photoelectron Spectroscopy,
J. Chem. Phys., 1993, 98, 10, 7730, https://doi.org/10.1063/1.464580
. [all data]
Compton and Stockdale, 1976
Compton, R.N.; Stockdale, J.A.D.,
Formation of gas phase negative ions in Fe(CO)5 and Ni(CO)4,
Int. J. Mass Spectrom. Ion Phys., 1976, 22, 47. [all data]
Sunderlin, Wang, et al., 1992
Sunderlin, L.S.; Wang, D.; Squires, R.R.,
Metal Carbonyl Bond Strengths in Fe(CO)n- and Ni(CO)n-,
J. Am. Chem. Soc., 1992, 114, 8, 2788, https://doi.org/10.1021/ja00034a004
. [all data]