2-(Hexyloxy)benzaldehyde
- Formula: C13H18O2
- Molecular weight: 206.2808
- IUPAC Standard InChIKey: IFOIDROUJIGQAV-UHFFFAOYSA-N
- CAS Registry Number: 7162-59-6
- Chemical structure:
View 3d structure (requires JavaScript / HTML 5) - Other names: o-Hexyloxybenzaldehyde; 2-n-Hexyloxybenzaldehyde; Benzaldehyde, 2-(hexyloxy)-; Benzaldehyde, o-(n-hexyloxy)-,

Phase change data

Data compiled by: Robert L. Brown and Stephen E. Stein
Reduced pressure boiling point
Tboil (K) | Pressure (bar) | Reference |
---|---|---|
403. to 408. | 0.0007 | Frinton Laboratories Inc., 1986 |

References

Frinton Laboratories Inc., 1986
Frinton Laboratories Inc.,
Catalog Number 11, Frinton Laboratories Inc., Vineland, NJ, 1986, 99. [all data]