3-(4-Methoxyphenyl)-1,1-dimethylurea
- Formula: C10H14N2O2
- Molecular weight: 194.2304
- IUPAC Standard InChIKey: LCLYWJDPJMDAQN-UHFFFAOYSA-N
- CAS Registry Number: 7160-02-3
- Chemical structure:
View 3d structure (requires JavaScript / HTML 5) - Other names: N,N-Dimethyl-N'-p-methylphenylurea

Reaction thermochemistry data

Data compiled by: Hussein Y. Afeefy, Joel F. Liebman, and Stephen E. Stein
Individual Reactions
By formula: C10H14N2O2 = C2H7N + C8H7NO2
Quantity | Value | Units | Method | Reference | Comment |
---|---|---|---|---|---|
ΔrH° | 95.2 ± 0.9 | kJ/mol | Eqk | Chimishkyan, Svetlova, et al., 1984 | solid phase; Dissociation |

References

Chimishkyan, Svetlova, et al., 1984
Chimishkyan, A.L.; Svetlova, L.P.; Leonova, T.V.; Gluyaev, N.D.,
Thermal decomposition of substituted ureas,
J. Gen. Chem. USSR, 1984, 54, 1317-1320. [all data]