U2F10
- Formula: F10U2
- Molecular weight: 666.04185
- CAS Registry Number: 71596-44-6

Reaction thermochemistry data

Data compiled by: John E. Bartmess
Individual Reactions
By formula: F- + F10U2 = (F- • F10U2)
Quantity | Value | Units | Method | Reference | Comment |
---|---|---|---|---|---|
ΔrH° | 129. ± 12. | kcal/mol | Ther | Pyatenko and Gorokhov, 1984 | gas phase; value altered from reference due to conversion from electron convention to ion convention |

Ion clustering data

Data compiled by: John E. Bartmess
Clustering reactions
By formula: F- + F10U2 = (F- • F10U2)
Quantity | Value | Units | Method | Reference | Comment |
---|---|---|---|---|---|
ΔrH° | 129. ± 12. | kcal/mol | Ther | Pyatenko and Gorokhov, 1984 | gas phase; value altered from reference due to conversion from electron convention to ion convention |

References

Pyatenko and Gorokhov, 1984
Pyatenko, A.T.; Gorokhov, L.N.,
Electron Affinities of the U2Fn Molecules (8n12),
Chem. Phys. Lett., 1984, 105, 2, (1984)}, https://doi.org/10.1016/0009-2614(84)85651-1
. [all data]