Heptane, 3,3,5-trimethyl-
- Formula: C10H22
- Molecular weight: 142.2817
- IUPAC Standard InChIKey: VRVRZZWPKABUOE-UHFFFAOYSA-N
- CAS Registry Number: 7154-80-5
- Chemical structure:
View 3d structure (requires JavaScript / HTML 5) - Other names: 3,3,5-Trimethylheptane

Phase change data

Data compiled as indicated in comments:
TRC - Thermodynamics Research Center, NIST Boulder Laboratories, Chris Muzny director
AC - William E. Acree, Jr., James S. Chickos
Quantity | Value | Units | Method | Reference | Comment |
---|---|---|---|---|---|
Tboil | 428.8 | K | N/A | Anonymous, 1952 | Uncertainty assigned by TRC = 0.3 K; TRC |
Tboil | 434.7 | K | N/A | Foehr and Fenske, 1949 | Uncertainty assigned by TRC = 1.5 K; TRC |
Tboil | 428.83 | K | N/A | Pomerantz, Mears, et al., 1949 | Uncertainty assigned by TRC = 0.3 K; TRC |
Quantity | Value | Units | Method | Reference | Comment |
Tc | 609.5 ± 0.5 | K | N/A | Daubert, 1996 | |
Tc | 609.55 | K | N/A | Ambrose and Townsend, 1968 | Uncertainty assigned by TRC = 0.15 K; extrapolated back to zero time to correct for decomposition; TRC |
Quantity | Value | Units | Method | Reference | Comment |
Pc | 23.2 ± 0.4 | bar | N/A | Daubert, 1996 | |
Pc | 23.17 | bar | N/A | Ambrose and Townsend, 1968 | Uncertainty assigned by TRC = 0.20 bar; TRC |
Quantity | Value | Units | Method | Reference | Comment |
ΔvapH° | 46.0 | kJ/mol | N/A | Reid, 1972 | AC |

Henry's Law data

Data compiled by: Rolf Sander
Henry's Law constant (water solution)
kH(T) = k°H exp(d(ln(kH))/d(1/T) ((1/T) - 1/(298.15 K)))
k°H = Henry's law constant for solubility in water at 298.15 K (mol/(kg*bar))
d(ln(kH))/d(1/T) = Temperature dependence constant (K)
k°H (mol/(kg*bar)) | d(ln(kH))/d(1/T) (K) | Method | Reference | Comment |
---|---|---|---|---|
0.00014 | Q | N/A | missing citation give several references for the Henry's law constants but don't assign them to specific species. |

Kovats' RI, non-polar column, isothermal

Column type | Active phase | Temperature (C) | I | Reference | Comment |
---|---|---|---|---|---|
Capillary | Squalane | 100. | 908. | Heinzen, Soares, et al., 1999 | |
Capillary | Squalane | 60. | 907.7 | Chretien and Dubois, 1976 | |
Capillary | Vacuum Grease Oil (VM-4) | 95. | 907.7 | Sultanov and Arustamova, 1975 | N2; Column length: 150. m; Column diameter: 0.25 mm |
Capillary | Squalane | 60. | 908. | Matukuma, 1969 | N2; Column length: 91.4 m; Column diameter: 0.25 mm |

Kovats' RI, non-polar column, temperature ramp

Column type | Active phase | I | Reference | Comment |
---|---|---|---|---|
Capillary | Apiezon L | 911. | Louis, 1971 | N2, 1. K/min; Column length: 50. m; Column diameter: 0.25 mm; Tstart: 60. C |

Kovats' RI, non-polar column, custom temperature program

Column type | Active phase | I | Reference | Comment |
---|---|---|---|---|
Capillary | Squalane | 906. | Korol and Lysyuk, 1980 | Program: not specified |

Van Den Dool and Kratz RI, non-polar column, temperature ramp

Column type | Active phase | I | Reference | Comment |
---|---|---|---|---|
Capillary | OV-101 | 913.2 | Yin, Liu, et al., 2001 | N2, 1. K/min; Column length: 80. m; Column diameter: 0.22 mm; Tstart: 30. C; Tend: 130. C |
Capillary | Petrocol DH | 909. | White, Hackett, et al., 1992 | 100. m/0.25 mm/0.5 μm, He, 1. K/min; Tstart: 30. C; Tend: 220. C |

Van Den Dool and Kratz RI, non-polar column, custom temperature program

Column type | Active phase | I | Reference | Comment |
---|---|---|---|---|
Capillary | OV-101 | 913. | Wu and Lu, 1984 | Program: not specified |

Normal alkane RI, non-polar column, isothermal

Column type | Active phase | Temperature (C) | I | Reference | Comment |
---|---|---|---|---|---|
Capillary | OV-101 | 70. | 913. | Wu and Lu, 1984, 2 |

Normal alkane RI, non-polar column, temperature ramp

Column type | Active phase | I | Reference | Comment |
---|---|---|---|---|
Capillary | Petrocol DH | 913. | Supelco, 2012 | 100. m/0.25 mm/0.50 μm, Helium, 20. C @ 15. min, 15. K/min, 220. C @ 30. min |

Normal alkane RI, non-polar column, custom temperature program

Column type | Active phase | I | Reference | Comment |
---|---|---|---|---|
Capillary | OV-101 | 908. | Du and Liang, 2003 | Program: not specified |
Capillary | Polydimethyl siloxane | 908. | Junkes, Castanho, et al., 2003 | Program: not specified |
Capillary | Polydimethyl siloxanes | 913. | Yin, Guo, et al., 2001 | Program: not specified |

References

Anonymous, 1952
Anonymous, R.,
, Physical Properties of Chemical Substances, Dow Chemical Co., 1952. [all data]
Foehr and Fenske, 1949
Foehr, E.G.; Fenske, M.R.,
Magneto-optic Rotation of Hydrocarbons,
Ind. Eng. Chem., 1949, 41, 1956. [all data]
Pomerantz, Mears, et al., 1949
Pomerantz, P.; Mears, T.W.; Howard, F.L.,
Separation and Identification of the Major C1 to C10 Components of Triptene Residue,
J. Res. Natl. Bur. Stand. (U. S.), 1949, 42, 617-32. [all data]
Daubert, 1996
Daubert, T.E.,
Vapor-Liquid Critical Properties of Elements and Compounds. 5. Branched Alkanes and Cycloalkanes,
J. Chem. Eng. Data, 1996, 41, 365-372. [all data]
Ambrose and Townsend, 1968
Ambrose, D.; Townsend, R.,
Critical Temperatures and Pressures of Some Alkanes,
Trans. Faraday Soc., 1968, 64, 2622. [all data]
Reid, 1972
Reid, Robert C.,
Handbook on vapor pressure and heats of vaporization of hydrocarbons and related compounds, R. C. Wilhort and B. J. Zwolinski, Texas A Research Foundation. College Station, Texas(1971). 329 pages.$10.00,
AIChE J., 1972, 18, 6, 1278-1278, https://doi.org/10.1002/aic.690180637
. [all data]