O-bromobenzoyl chloride
- Formula: C7H4BrClO
- Molecular weight: 219.463
- IUPAC Standard InChIKey: NZCKTGCKFJDGFD-UHFFFAOYSA-N
- CAS Registry Number: 7154-66-7
- Chemical structure:
View 3d structure (requires JavaScript / HTML 5) - Other names: 2-bromobenzoyl chloride

Phase change data

Data compiled by: Robert L. Brown and Stephen E. Stein
Quantity | Value | Units | Method | Reference | Comment |
---|---|---|---|---|---|
Tboil | 518.2 | K | N/A | Weast and Grasselli, 1989 | |
Tboil | 518. | K | N/A | Buckingham and Donaghy, 1982 | |
Quantity | Value | Units | Method | Reference | Comment |
Tfus | 284. | K | N/A | Buckingham and Donaghy, 1982 |
Reduced pressure boiling point
Tboil (K) | Pressure (bar) | Reference |
---|---|---|
398. | 0.027 | Buckingham and Donaghy, 1982 |

References

Weast and Grasselli, 1989
CRC Handbook of Data on Organic Compounds, 2nd Editon, Weast,R.C and Grasselli, J.G., ed(s)., CRC Press, Inc., Boca Raton, FL, 1989, 1. [all data]
Buckingham and Donaghy, 1982
Buckingham, J.; Donaghy, S.M.,
Dictionary of Organic Compounds: Fifth Edition, Chapman and Hall, New York, 1982, 1. [all data]