MeCO2 anion
- Formula: C2H3O2-
- Molecular weight: 59.0446
- IUPAC Standard InChIKey: QTBSBXVTEAMEQO-UHFFFAOYSA-M
- CAS Registry Number: 71-50-1
- Chemical structure:
View 3d structure (requires JavaScript / HTML 5) - Permanent link for this species. Use this link for bookmarking this species for future reference.

Reaction thermochemistry data

Data compiled as indicated in comments:
B - John E. Bartmess
M - Michael M. Meot-Ner (Mautner) and Sharon G. Lias
Individual Reactions
By formula: C2H3O2- + H2O = (C2H3O2- • H2O)
Bond type: Hydrogen bond (negative ion to hydride)
Quantity | Value | Units | Method | Reference | Comment |
---|---|---|---|---|---|
ΔrH° | 68.6 ± 3.3 | kJ/mol | TDAs | Wincel, 2008 | gas phase; B |
ΔrH° | 66.5 ± 4.2 | kJ/mol | N/A | Meot-ner, Elmore, et al., 1999 | gas phase; B |
ΔrH° | 66.9 ± 4.2 | kJ/mol | N/A | Meot-Ner and Sieck, 1986 | gas phase; B,M |
ΔrH° | 68.6 ± 6.3 | kJ/mol | TDAs | Blades, Klassen, et al., 1995 | gas phase; T: 293 K. ΔSaff approx. 24 cal/mol-K; B |
ΔrH° | 66.1 | kJ/mol | PHPMS | Meot-ner, 1988 | gas phase; M |
Quantity | Value | Units | Method | Reference | Comment |
ΔrS° | 84.9 | J/mol*K | PHPMS | Meot-ner, 1988 | gas phase; M |
ΔrS° | 94.1 | J/mol*K | PHPMS | Meot-Ner and Sieck, 1986 | gas phase; ion given as C2H3COO- in paper by error; M |
Quantity | Value | Units | Method | Reference | Comment |
ΔrG° | 38. ± 5.9 | kJ/mol | N/A | Wincel, 2008 | gas phase; B |
ΔrG° | 39.8 | kJ/mol | TDAs | Meot-ner, Elmore, et al., 1999 | gas phase; B |
ΔrG° | 39. ± 6.7 | kJ/mol | TDAs | Meot-Ner and Sieck, 1986 | gas phase; B |
ΔrG° | 39.3 ± 1.3 | kJ/mol | TDAs | Blades, Klassen, et al., 1995 | gas phase; T: 293 K. ΔSaff approx. 24 cal/mol-K; B,M |
By formula: (C2H3O2- • 2H2O) + H2O = (C2H3O2- • 3H2O)
Bond type: Hydrogen bond (negative ion to hydride)
Quantity | Value | Units | Method | Reference | Comment |
---|---|---|---|---|---|
ΔrH° | 49.4 ± 4.2 | kJ/mol | N/A | Meot-ner, Elmore, et al., 1999 | gas phase; B |
ΔrH° | 51.0 ± 6.3 | kJ/mol | TDAs | Blades, Klassen, et al., 1995 | gas phase; T: 293 K. ΔSaff approx. 24 cal/mol-K; B |
ΔrH° | 49.4 | kJ/mol | PHPMS | Meot-ner, 1988 | gas phase; Entropy change calculated or estimated; M |
Quantity | Value | Units | Method | Reference | Comment |
ΔrS° | 84. | J/mol*K | N/A | Meot-ner, 1988 | gas phase; Entropy change calculated or estimated; M |
Quantity | Value | Units | Method | Reference | Comment |
ΔrG° | 24.4 | kJ/mol | TDAs | Meot-ner, Elmore, et al., 1999 | gas phase; B |
ΔrG° | 21.8 ± 1.3 | kJ/mol | TDAs | Blades, Klassen, et al., 1995 | gas phase; T: 293 K. ΔSaff approx. 24 cal/mol-K; B,M |
ΔrG° | 25. | kJ/mol | PHPMS | Meot-ner, 1988 | gas phase; Entropy change calculated or estimated; M |
By formula: C2H3O2- + H+ = C2H4O2
Quantity | Value | Units | Method | Reference | Comment |
---|---|---|---|---|---|
ΔrH° | 1457. ± 5.9 | kJ/mol | CIDC | Angel and Ervin, 2006 | gas phase; B |
ΔrH° | 1456. ± 9.2 | kJ/mol | G+TS | Taft and Topsom, 1987 | gas phase; B |
ΔrH° | 1459. ± 8.8 | kJ/mol | G+TS | Cumming and Kebarle, 1978 | gas phase; B |
ΔrH° | 1459. ± 9.2 | kJ/mol | G+TS | Fujio, McIver, et al., 1981 | gas phase; value altered from reference due to change in acidity scale; B |
ΔrH° | 1435.9 ± 2.9 | kJ/mol | EIAE | Muftakhov, Vasil'ev, et al., 1999 | gas phase; B |
Quantity | Value | Units | Method | Reference | Comment |
ΔrG° | 1427. ± 8.4 | kJ/mol | IMRE | Taft and Topsom, 1987 | gas phase; B |
ΔrG° | 1429. ± 8.4 | kJ/mol | IMRE | Cumming and Kebarle, 1978 | gas phase; B |
ΔrG° | 1430. ± 8.4 | kJ/mol | IMRE | Fujio, McIver, et al., 1981 | gas phase; value altered from reference due to change in acidity scale; B |
By formula: (C2H3O2- • H2O) + H2O = (C2H3O2- • 2H2O)
Bond type: Hydrogen bond (negative ion to hydride)
Quantity | Value | Units | Method | Reference | Comment |
---|---|---|---|---|---|
ΔrH° | 54.0 ± 4.2 | kJ/mol | N/A | Meot-ner, Elmore, et al., 1999 | gas phase; B |
ΔrH° | 57.7 ± 6.3 | kJ/mol | TDAs | Blades, Klassen, et al., 1995 | gas phase; T: 293 K. ΔSaff approx. 24 cal/mol-K; B |
ΔrH° | 53.6 | kJ/mol | PHPMS | Meot-ner, 1988 | gas phase; M |
ΔrH° | 54.0 | kJ/mol | PHPMS | Meot-Ner and Sieck, 1986 | gas phase; M |
Quantity | Value | Units | Method | Reference | Comment |
ΔrS° | 79.9 | J/mol*K | PHPMS | Meot-ner, 1988 | gas phase; M |
ΔrS° | 85.8 | J/mol*K | PHPMS | Meot-Ner and Sieck, 1986 | gas phase; M |
Quantity | Value | Units | Method | Reference | Comment |
ΔrG° | 29.3 | kJ/mol | TDAs | Meot-ner, Elmore, et al., 1999 | gas phase; B |
ΔrG° | 28.5 ± 1.3 | kJ/mol | TDAs | Blades, Klassen, et al., 1995 | gas phase; T: 293 K. ΔSaff approx. 24 cal/mol-K; B,M |
By formula: (C2H3O2- • 4CHN) + CHN = (C2H3O2- • 5CHN)
Quantity | Value | Units | Method | Reference | Comment |
---|---|---|---|---|---|
ΔrH° | 41. ± 4.2 | kJ/mol | TDAs | Meot-ner, Cybulski, et al., 1988 | gas phase; Entropy estimated; B,M |
Quantity | Value | Units | Method | Reference | Comment |
ΔrS° | 100. | J/mol*K | N/A | Meot-ner, Cybulski, et al., 1988 | gas phase; Entropy change calculated or estimated; M |
Quantity | Value | Units | Method | Reference | Comment |
ΔrG° | 10.0 | kJ/mol | TDAs | Meot-ner, Cybulski, et al., 1988 | gas phase; Entropy estimated; B |
Free energy of reaction
ΔrG° (kJ/mol) | T (K) | Method | Reference | Comment |
---|---|---|---|---|
19. | 213. | PHPMS | Meot-ner, Cybulski, et al., 1988 | gas phase; Entropy change calculated or estimated; M |
By formula: (C2H3O2- • 2C2H4O2 • H2O) + C2H4O2 = (C2H3O2- • 3C2H4O2 • H2O)
Quantity | Value | Units | Method | Reference | Comment |
---|---|---|---|---|---|
ΔrH° | 52.3 ± 2.5 | kJ/mol | N/A | Meot-ner, Elmore, et al., 1999 | gas phase; B |
ΔrH° | 67.8 ± 4.2 | kJ/mol | TDAs | Meot-Ner and Sieck, 1986 | gas phase; B |
Quantity | Value | Units | Method | Reference | Comment |
ΔrG° | 24.0 | kJ/mol | TDAs | Meot-ner, Elmore, et al., 1999 | gas phase; B |
ΔrG° | 26. ± 4.2 | kJ/mol | TDAs | Meot-Ner and Sieck, 1986 | gas phase; B |
By formula: (C2H3O2- • C2H4O2 • H2O) + C2H4O2 = (C2H3O2- • 2C2H4O2 • H2O)
Quantity | Value | Units | Method | Reference | Comment |
---|---|---|---|---|---|
ΔrH° | 82.4 ± 2.1 | kJ/mol | N/A | Meot-ner, Elmore, et al., 1999 | gas phase; B |
ΔrH° | 67.8 ± 4.2 | kJ/mol | TDAs | Meot-Ner and Sieck, 1986 | gas phase; B |
Quantity | Value | Units | Method | Reference | Comment |
ΔrG° | 45.23 | kJ/mol | TDAs | Meot-ner, Elmore, et al., 1999 | gas phase; B |
ΔrG° | 26. ± 4.2 | kJ/mol | TDAs | Meot-Ner and Sieck, 1986 | gas phase; B |
By formula: C2H3O2- + C3H6O = (C2H3O2- • C3H6O)
Bond type: Hydrogen bonds of deprotonated acids to ketones/
Quantity | Value | Units | Method | Reference | Comment |
---|---|---|---|---|---|
ΔrH° | 65.7 ± 4.2 | kJ/mol | TDAs | Meot-ner, 1988 | gas phase; B,M |
Quantity | Value | Units | Method | Reference | Comment |
ΔrS° | 91.6 | J/mol*K | PHPMS | Meot-ner, 1988 | gas phase; M |
Quantity | Value | Units | Method | Reference | Comment |
ΔrG° | 38. ± 4.2 | kJ/mol | TDAs | Meot-ner, 1988 | gas phase; B |
By formula: C2H3O2- + C2H4O = (C2H3O2- • C2H4O)
Bond type: Hydrogen bonds of deprotonated acids to ketones/
Quantity | Value | Units | Method | Reference | Comment |
---|---|---|---|---|---|
ΔrH° | 68.2 ± 4.2 | kJ/mol | TDAs | Meot-ner, 1988 | gas phase; B,M |
Quantity | Value | Units | Method | Reference | Comment |
ΔrS° | 90.8 | J/mol*K | PHPMS | Meot-ner, 1988 | gas phase; M |
Quantity | Value | Units | Method | Reference | Comment |
ΔrG° | 41. ± 8.4 | kJ/mol | TDAs | Meot-ner, 1988 | gas phase; B |
By formula: C2H3O2- + C3H7NO = (C2H3O2- • C3H7NO)
Bond type: Hydrogen bonds of deprotonated acids to amides
Quantity | Value | Units | Method | Reference | Comment |
---|---|---|---|---|---|
ΔrH° | 106. ± 4.2 | kJ/mol | TDAs | Meot-ner, 1988 | gas phase; B,M |
Quantity | Value | Units | Method | Reference | Comment |
ΔrS° | 115. | J/mol*K | PHPMS | Meot-Ner (Mautner), 1988 | gas phase; M |
Quantity | Value | Units | Method | Reference | Comment |
ΔrG° | 72.0 ± 4.2 | kJ/mol | TDAs | Meot-ner, 1988 | gas phase; B |
By formula: (C2H3O2- • 2CHN) + CHN = (C2H3O2- • 3CHN)
Quantity | Value | Units | Method | Reference | Comment |
---|---|---|---|---|---|
ΔrH° | 61.9 ± 4.2 | kJ/mol | TDAs | Meot-ner, Cybulski, et al., 1988 | gas phase; B,M |
Quantity | Value | Units | Method | Reference | Comment |
ΔrS° | 107. | J/mol*K | PHPMS | Meot-ner, Cybulski, et al., 1988 | gas phase; M |
Quantity | Value | Units | Method | Reference | Comment |
ΔrG° | 30.1 | kJ/mol | TDAs | Meot-ner, Cybulski, et al., 1988 | gas phase; B |
By formula: (C2H3O2- • 3CHN) + CHN = (C2H3O2- • 4CHN)
Quantity | Value | Units | Method | Reference | Comment |
---|---|---|---|---|---|
ΔrH° | 50.2 ± 4.2 | kJ/mol | TDAs | Meot-ner, Cybulski, et al., 1988 | gas phase; B,M |
Quantity | Value | Units | Method | Reference | Comment |
ΔrS° | 114. | J/mol*K | PHPMS | Meot-ner, Cybulski, et al., 1988 | gas phase; M |
Quantity | Value | Units | Method | Reference | Comment |
ΔrG° | 16.3 | kJ/mol | TDAs | Meot-ner, Cybulski, et al., 1988 | gas phase; B |
By formula: (C2H3O2- • CHN) + CHN = (C2H3O2- • 2CHN)
Quantity | Value | Units | Method | Reference | Comment |
---|---|---|---|---|---|
ΔrH° | 69.5 ± 4.2 | kJ/mol | TDAs | Meot-ner, Cybulski, et al., 1988 | gas phase; B,M |
Quantity | Value | Units | Method | Reference | Comment |
ΔrS° | 84.5 | J/mol*K | PHPMS | Meot-ner, Cybulski, et al., 1988 | gas phase; M |
Quantity | Value | Units | Method | Reference | Comment |
ΔrG° | 44.35 | kJ/mol | TDAs | Meot-ner, Cybulski, et al., 1988 | gas phase; B |
By formula: C2H3O2- + C6H6O = (C2H3O2- • C6H6O)
Quantity | Value | Units | Method | Reference | Comment |
---|---|---|---|---|---|
ΔrH° | 109. ± 4.2 | kJ/mol | N/A | Meot-Ner and Sieck, 1986 | gas phase; B,M |
Quantity | Value | Units | Method | Reference | Comment |
ΔrS° | 100. | J/mol*K | PHPMS | Meot-Ner and Sieck, 1986 | gas phase; M |
Quantity | Value | Units | Method | Reference | Comment |
ΔrG° | 79.1 ± 6.7 | kJ/mol | TDAs | Meot-Ner and Sieck, 1986 | gas phase; B |
By formula: C2H3O2- + C6H14O3 = (C2H3O2- • C6H14O3)
Quantity | Value | Units | Method | Reference | Comment |
---|---|---|---|---|---|
ΔrH° | 63.2 ± 4.2 | kJ/mol | N/A | Meot-Ner and Sieck, 1986 | gas phase; B,M |
Quantity | Value | Units | Method | Reference | Comment |
ΔrS° | 77.4 | J/mol*K | PHPMS | Meot-Ner and Sieck, 1986 | gas phase; M |
Quantity | Value | Units | Method | Reference | Comment |
ΔrG° | 40. ± 6.7 | kJ/mol | TDAs | Meot-Ner and Sieck, 1986 | gas phase; B |
By formula: C2H3O2- + C2H6O = (C2H3O2- • C2H6O)
Quantity | Value | Units | Method | Reference | Comment |
---|---|---|---|---|---|
ΔrH° | 86.6 ± 4.2 | kJ/mol | N/A | Meot-Ner and Sieck, 1986 | gas phase; B,M |
Quantity | Value | Units | Method | Reference | Comment |
ΔrS° | 122. | J/mol*K | PHPMS | Meot-Ner and Sieck, 1986 | gas phase; M |
Quantity | Value | Units | Method | Reference | Comment |
ΔrG° | 49.8 ± 6.7 | kJ/mol | TDAs | Meot-Ner and Sieck, 1986 | gas phase; B |
By formula: C2H3O2- + C4H5N = (C2H3O2- • C4H5N)
Quantity | Value | Units | Method | Reference | Comment |
---|---|---|---|---|---|
ΔrH° | 100. ± 4.2 | kJ/mol | TDAs | Meot-ner, 1988 | gas phase; B,M |
Quantity | Value | Units | Method | Reference | Comment |
ΔrS° | 105. | J/mol*K | PHPMS | Meot-ner, 1988 | gas phase; M |
Quantity | Value | Units | Method | Reference | Comment |
ΔrG° | 69.0 ± 4.2 | kJ/mol | TDAs | Meot-ner, 1988 | gas phase; B |
By formula: C2H3O2- + C8H7N = (C2H3O2- • C8H7N)
Quantity | Value | Units | Method | Reference | Comment |
---|---|---|---|---|---|
ΔrH° | 117. ± 4.2 | kJ/mol | TDAs | Meot-ner, 1988 | gas phase; B,M |
Quantity | Value | Units | Method | Reference | Comment |
ΔrS° | 127. | J/mol*K | PHPMS | Meot-ner, 1988 | gas phase; M |
Quantity | Value | Units | Method | Reference | Comment |
ΔrG° | 78.7 ± 4.2 | kJ/mol | TDAs | Meot-ner, 1988 | gas phase; B |
By formula: C2H3O2- + CH4S = (C2H3O2- • CH4S)
Quantity | Value | Units | Method | Reference | Comment |
---|---|---|---|---|---|
ΔrH° | 62.3 ± 4.2 | kJ/mol | TDAs | Meot-ner, 1988 | gas phase; B,M |
Quantity | Value | Units | Method | Reference | Comment |
ΔrS° | 95.4 | J/mol*K | PHPMS | Meot-ner, 1988 | gas phase; M |
Quantity | Value | Units | Method | Reference | Comment |
ΔrG° | 34. ± 4.2 | kJ/mol | TDAs | Meot-ner, 1988 | gas phase; B |
By formula: C2H3O2- + C2H3N = (C2H3O2- • C2H3N)
Quantity | Value | Units | Method | Reference | Comment |
---|---|---|---|---|---|
ΔrH° | 61.9 ± 4.2 | kJ/mol | TDAs | Meot-ner, 1988 | gas phase; B,M |
Quantity | Value | Units | Method | Reference | Comment |
ΔrS° | 75.3 | J/mol*K | PHPMS | Meot-ner, 1988 | gas phase; M |
Quantity | Value | Units | Method | Reference | Comment |
ΔrG° | 39. ± 4.2 | kJ/mol | TDAs | Meot-ner, 1988 | gas phase; B |
By formula: (C2H3O2- • C6H11NO3) + H2O = (C2H3O2- • H2O • C6H11NO3)
Bond type: Hydrogen bond (negative ion to hydride)
Quantity | Value | Units | Method | Reference | Comment |
---|---|---|---|---|---|
ΔrH° | 55.2 | kJ/mol | PHPMS | Meot-Ner (Mautner), 1988 | gas phase; M |
Quantity | Value | Units | Method | Reference | Comment |
ΔrS° | 106. | J/mol*K | PHPMS | Meot-Ner (Mautner), 1988 | gas phase; M |
By formula: (C2H3O2- • C3H6O) + C3H6O = (C2H3O2- • 2C3H6O)
Bond type: Hydrogen bonds of deprotonated acids to ketones/
Quantity | Value | Units | Method | Reference | Comment |
---|---|---|---|---|---|
ΔrH° | 45.2 | kJ/mol | PHPMS | Meot-ner, 1988 | gas phase; M |
Quantity | Value | Units | Method | Reference | Comment |
ΔrS° | 74.9 | J/mol*K | PHPMS | Meot-ner, 1988 | gas phase; M |
By formula: (C2H3O2- • C3H7NO) + C3H7NO = (C2H3O2- • 2C3H7NO)
Bond type: Hydrogen bonds of deprotonated acids to amides
Quantity | Value | Units | Method | Reference | Comment |
---|---|---|---|---|---|
ΔrH° | 73.6 | kJ/mol | PHPMS | Meot-Ner (Mautner), 1988 | gas phase; M |
Quantity | Value | Units | Method | Reference | Comment |
ΔrS° | 91.2 | J/mol*K | PHPMS | Meot-Ner (Mautner), 1988 | gas phase; M |
By formula: (C2H3O2- • H2O) + C2H4O2 = (C2H3O2- • C2H4O2 • H2O)
Quantity | Value | Units | Method | Reference | Comment |
---|---|---|---|---|---|
ΔrH° | 123. ± 4.2 | kJ/mol | TDAs | Meot-Ner and Sieck, 1986 | gas phase; B |
Quantity | Value | Units | Method | Reference | Comment |
ΔrG° | 85.4 ± 6.7 | kJ/mol | TDAs | Meot-Ner and Sieck, 1986 | gas phase; B |
By formula: C2H3O2- + CHN = (C2H3O2- • CHN)
Quantity | Value | Units | Method | Reference | Comment |
---|---|---|---|---|---|
ΔrH° | 92.9 ± 4.2 | kJ/mol | TDAs | Meot-ner, Cybulski, et al., 1988 | gas phase; B,B,M |
Quantity | Value | Units | Method | Reference | Comment |
ΔrS° | 98.3 | J/mol*K | PHPMS | Meot-ner, Cybulski, et al., 1988 | gas phase; M |
By formula: C2H3O2- + C6H11NO3 = (C2H3O2- • C6H11NO3)
Quantity | Value | Units | Method | Reference | Comment |
---|---|---|---|---|---|
ΔrH° | 131. ± 4.2 | kJ/mol | TDAs | Meot-ner, 1988 | gas phase; B |
Quantity | Value | Units | Method | Reference | Comment |
ΔrG° | 86.6 ± 4.2 | kJ/mol | TDAs | Meot-ner, 1988 | gas phase; B |
By formula: C2H3O2- + CH4O = (C2H3O2- • CH4O)
Quantity | Value | Units | Method | Reference | Comment |
---|---|---|---|---|---|
ΔrH° | 73.6 ± 4.2 | kJ/mol | TDAs | Meot-ner, 1988 | gas phase; B |
Quantity | Value | Units | Method | Reference | Comment |
ΔrG° | 43.9 ± 4.2 | kJ/mol | TDAs | Meot-ner, 1988 | gas phase; B |
By formula: (C2H3O2- • H2O) + C6H11NO3 = (C2H3O2- • C6H11NO3 • H2O)
Quantity | Value | Units | Method | Reference | Comment |
---|---|---|---|---|---|
ΔrH° | 115. | kJ/mol | PHPMS | Meot-Ner (Mautner), 1988 | gas phase; M |
Quantity | Value | Units | Method | Reference | Comment |
ΔrS° | 163. | J/mol*K | PHPMS | Meot-Ner (Mautner), 1988 | gas phase; M |
By formula: (C2H3O2- • 2C2H4O2) + C2H4O2 = (C2H3O2- • 3C2H4O2)
Quantity | Value | Units | Method | Reference | Comment |
---|---|---|---|---|---|
ΔrH° | 67.8 | kJ/mol | PHPMS | Meot-Ner and Sieck, 1986 | gas phase; M |
Quantity | Value | Units | Method | Reference | Comment |
ΔrS° | 139. | J/mol*K | PHPMS | Meot-Ner and Sieck, 1986 | gas phase; M |
By formula: (C2H3O2- • C2H4O2) + C2H4O2 = (C2H3O2- • 2C2H4O2)
Quantity | Value | Units | Method | Reference | Comment |
---|---|---|---|---|---|
ΔrH° | 82.0 | kJ/mol | PHPMS | Meot-Ner and Sieck, 1986 | gas phase; M |
Quantity | Value | Units | Method | Reference | Comment |
ΔrS° | 120. | J/mol*K | PHPMS | Meot-Ner and Sieck, 1986 | gas phase; M |
By formula: (C2H3O2- • C6H11NO3) + C6H11NO3 = (C2H3O2- • 2C6H11NO3)
Quantity | Value | Units | Method | Reference | Comment |
---|---|---|---|---|---|
ΔrH° | 88.7 | kJ/mol | PHPMS | Meot-Ner (Mautner), 1988 | gas phase; M |
Quantity | Value | Units | Method | Reference | Comment |
ΔrS° | 143. | J/mol*K | PHPMS | Meot-Ner (Mautner), 1988 | gas phase; M |
By formula: (C2H3O2- • C4H5N) + C4H5N = (C2H3O2- • 2C4H5N)
Quantity | Value | Units | Method | Reference | Comment |
---|---|---|---|---|---|
ΔrH° | 74.9 | kJ/mol | PHPMS | Meot-ner, 1988 | gas phase; M |
Quantity | Value | Units | Method | Reference | Comment |
ΔrS° | 101. | J/mol*K | PHPMS | Meot-ner, 1988 | gas phase; M |
By formula: C2H3O2- + C2H4O2 = (C2H3O2- • C2H4O2)
Quantity | Value | Units | Method | Reference | Comment |
---|---|---|---|---|---|
ΔrH° | 123. | kJ/mol | PHPMS | Meot-Ner and Sieck, 1986 | gas phase; M |
Quantity | Value | Units | Method | Reference | Comment |
ΔrS° | 124. | J/mol*K | PHPMS | Meot-Ner and Sieck, 1986 | gas phase; M |
By formula: C2H3O2- + C6H11NO3 = (C2H3O2- • C6H11NO3)
Quantity | Value | Units | Method | Reference | Comment |
---|---|---|---|---|---|
ΔrH° | 126. | kJ/mol | PHPMS | Meot-Ner (Mautner), 1988 | gas phase; M |
Quantity | Value | Units | Method | Reference | Comment |
ΔrS° | 141. | J/mol*K | PHPMS | Meot-Ner (Mautner), 1988 | gas phase; M |
By formula: C2H3O2- + C3H4N2 = (C2H3O2- • C3H4N2)
Quantity | Value | Units | Method | Reference | Comment |
---|---|---|---|---|---|
ΔrH° | 116. | kJ/mol | PHPMS | Meot-Ner (Mautner), 1988 | gas phase; M |
Quantity | Value | Units | Method | Reference | Comment |
ΔrS° | 102. | J/mol*K | PHPMS | Meot-Ner (Mautner), 1988 | gas phase; M |
By formula: (C2H3O2- • 4294967295CO2) + CO2 = C2H3O2-
Quantity | Value | Units | Method | Reference | Comment |
---|---|---|---|---|---|
ΔrH° | 250. ± 10. | kJ/mol | CIDC | Wenthold and Squires, 1994 | gas phase; B |

Gas phase ion energetics data

Data compiled by: John E. Bartmess
Electron affinity of neutral species
EAneutral (eV) | Method | Reference | Comment |
---|---|---|---|
3.250 ± 0.010 | LPES | Wang, Woo, et al., 2006 | At 20 K |
3.380 ± 0.050 | LPES | Wang, Jagoda-Cwiklik, et al., 2009 | |
<3.470 ± 0.010 | LPES | Lu and Continetti, 2004 | EA is upper limit, though close |
3.40 ± 0.30 | LPES | Ding, Wang, et al., 1998 | Around 3.4 eV" for CH3(CH2)nCO2-, n=0-8, Dervived DH = 113.4±8 kcal/mol |
3.179 ± 0.052 | ECD | Wentworth, Chen, et al., 1968 | Data reworked with current bond strengths |
3.30 ± 0.20 | EIAE | Tsuda and Hamill, 1964 | From MeCO2Et |
Protonation reactions
By formula: C2H3O2- + H+ = C2H4O2
Quantity | Value | Units | Method | Reference | Comment |
---|---|---|---|---|---|
ΔrH° | 1457. ± 5.9 | kJ/mol | CIDC | Angel and Ervin, 2006 | gas phase |
ΔrH° | 1456. ± 9.2 | kJ/mol | G+TS | Taft and Topsom, 1987 | gas phase |
ΔrH° | 1459. ± 8.8 | kJ/mol | G+TS | Cumming and Kebarle, 1978 | gas phase |
ΔrH° | 1459. ± 9.2 | kJ/mol | G+TS | Fujio, McIver, et al., 1981 | gas phase; value altered from reference due to change in acidity scale |
ΔrH° | 1435.9 ± 2.9 | kJ/mol | EIAE | Muftakhov, Vasil'ev, et al., 1999 | gas phase |
Quantity | Value | Units | Method | Reference | Comment |
ΔrG° | 1427. ± 8.4 | kJ/mol | IMRE | Taft and Topsom, 1987 | gas phase |
ΔrG° | 1429. ± 8.4 | kJ/mol | IMRE | Cumming and Kebarle, 1978 | gas phase |
ΔrG° | 1430. ± 8.4 | kJ/mol | IMRE | Fujio, McIver, et al., 1981 | gas phase; value altered from reference due to change in acidity scale |

Ion clustering data

Data compiled as indicated in comments:
B - John E. Bartmess
M - Michael M. Meot-Ner (Mautner) and Sharon G. Lias
Clustering reactions
By formula: C2H3O2- + CHN = (C2H3O2- • CHN)
Quantity | Value | Units | Method | Reference | Comment |
---|---|---|---|---|---|
ΔrH° | 92.9 ± 4.2 | kJ/mol | TDAs | Meot-ner, Cybulski, et al., 1988 | gas phase; B,B,M |
Quantity | Value | Units | Method | Reference | Comment |
ΔrS° | 98.3 | J/mol*K | PHPMS | Meot-ner, Cybulski, et al., 1988 | gas phase; M |
By formula: (C2H3O2- • CHN) + CHN = (C2H3O2- • 2CHN)
Quantity | Value | Units | Method | Reference | Comment |
---|---|---|---|---|---|
ΔrH° | 69.5 ± 4.2 | kJ/mol | TDAs | Meot-ner, Cybulski, et al., 1988 | gas phase; B,M |
Quantity | Value | Units | Method | Reference | Comment |
ΔrS° | 84.5 | J/mol*K | PHPMS | Meot-ner, Cybulski, et al., 1988 | gas phase; M |
Quantity | Value | Units | Method | Reference | Comment |
ΔrG° | 44.35 | kJ/mol | TDAs | Meot-ner, Cybulski, et al., 1988 | gas phase; B |
By formula: (C2H3O2- • 2CHN) + CHN = (C2H3O2- • 3CHN)
Quantity | Value | Units | Method | Reference | Comment |
---|---|---|---|---|---|
ΔrH° | 61.9 ± 4.2 | kJ/mol | TDAs | Meot-ner, Cybulski, et al., 1988 | gas phase; B,M |
Quantity | Value | Units | Method | Reference | Comment |
ΔrS° | 107. | J/mol*K | PHPMS | Meot-ner, Cybulski, et al., 1988 | gas phase; M |
Quantity | Value | Units | Method | Reference | Comment |
ΔrG° | 30.1 | kJ/mol | TDAs | Meot-ner, Cybulski, et al., 1988 | gas phase; B |
By formula: (C2H3O2- • 3CHN) + CHN = (C2H3O2- • 4CHN)
Quantity | Value | Units | Method | Reference | Comment |
---|---|---|---|---|---|
ΔrH° | 50.2 ± 4.2 | kJ/mol | TDAs | Meot-ner, Cybulski, et al., 1988 | gas phase; B,M |
Quantity | Value | Units | Method | Reference | Comment |
ΔrS° | 114. | J/mol*K | PHPMS | Meot-ner, Cybulski, et al., 1988 | gas phase; M |
Quantity | Value | Units | Method | Reference | Comment |
ΔrG° | 16.3 | kJ/mol | TDAs | Meot-ner, Cybulski, et al., 1988 | gas phase; B |
By formula: (C2H3O2- • 4CHN) + CHN = (C2H3O2- • 5CHN)
Quantity | Value | Units | Method | Reference | Comment |
---|---|---|---|---|---|
ΔrH° | 41. ± 4.2 | kJ/mol | TDAs | Meot-ner, Cybulski, et al., 1988 | gas phase; Entropy estimated; B,M |
Quantity | Value | Units | Method | Reference | Comment |
ΔrS° | 100. | J/mol*K | N/A | Meot-ner, Cybulski, et al., 1988 | gas phase; Entropy change calculated or estimated; M |
Quantity | Value | Units | Method | Reference | Comment |
ΔrG° | 10.0 | kJ/mol | TDAs | Meot-ner, Cybulski, et al., 1988 | gas phase; Entropy estimated; B |
Free energy of reaction
ΔrG° (kJ/mol) | T (K) | Method | Reference | Comment |
---|---|---|---|---|
19. | 213. | PHPMS | Meot-ner, Cybulski, et al., 1988 | gas phase; Entropy change calculated or estimated; M |
By formula: C2H3O2- + CH4O = (C2H3O2- • CH4O)
Quantity | Value | Units | Method | Reference | Comment |
---|---|---|---|---|---|
ΔrH° | 73.6 ± 4.2 | kJ/mol | TDAs | Meot-ner, 1988 | gas phase; B |
Quantity | Value | Units | Method | Reference | Comment |
ΔrG° | 43.9 ± 4.2 | kJ/mol | TDAs | Meot-ner, 1988 | gas phase; B |
By formula: C2H3O2- + CH4S = (C2H3O2- • CH4S)
Quantity | Value | Units | Method | Reference | Comment |
---|---|---|---|---|---|
ΔrH° | 62.3 ± 4.2 | kJ/mol | TDAs | Meot-ner, 1988 | gas phase; B,M |
Quantity | Value | Units | Method | Reference | Comment |
ΔrS° | 95.4 | J/mol*K | PHPMS | Meot-ner, 1988 | gas phase; M |
Quantity | Value | Units | Method | Reference | Comment |
ΔrG° | 34. ± 4.2 | kJ/mol | TDAs | Meot-ner, 1988 | gas phase; B |
By formula: (C2H3O2- • 4294967295CO2) + CO2 = C2H3O2-
Quantity | Value | Units | Method | Reference | Comment |
---|---|---|---|---|---|
ΔrH° | 250. ± 10. | kJ/mol | CIDC | Wenthold and Squires, 1994 | gas phase; B |
By formula: C2H3O2- + C2H3N = (C2H3O2- • C2H3N)
Quantity | Value | Units | Method | Reference | Comment |
---|---|---|---|---|---|
ΔrH° | 61.9 ± 4.2 | kJ/mol | TDAs | Meot-ner, 1988 | gas phase; B,M |
Quantity | Value | Units | Method | Reference | Comment |
ΔrS° | 75.3 | J/mol*K | PHPMS | Meot-ner, 1988 | gas phase; M |
Quantity | Value | Units | Method | Reference | Comment |
ΔrG° | 39. ± 4.2 | kJ/mol | TDAs | Meot-ner, 1988 | gas phase; B |
By formula: C2H3O2- + C2H4O = (C2H3O2- • C2H4O)
Bond type: Hydrogen bonds of deprotonated acids to ketones/
Quantity | Value | Units | Method | Reference | Comment |
---|---|---|---|---|---|
ΔrH° | 68.2 ± 4.2 | kJ/mol | TDAs | Meot-ner, 1988 | gas phase; B,M |
Quantity | Value | Units | Method | Reference | Comment |
ΔrS° | 90.8 | J/mol*K | PHPMS | Meot-ner, 1988 | gas phase; M |
Quantity | Value | Units | Method | Reference | Comment |
ΔrG° | 41. ± 8.4 | kJ/mol | TDAs | Meot-ner, 1988 | gas phase; B |
By formula: C2H3O2- + C2H4O2 = (C2H3O2- • C2H4O2)
Quantity | Value | Units | Method | Reference | Comment |
---|---|---|---|---|---|
ΔrH° | 123. | kJ/mol | PHPMS | Meot-Ner and Sieck, 1986 | gas phase; M |
Quantity | Value | Units | Method | Reference | Comment |
ΔrS° | 124. | J/mol*K | PHPMS | Meot-Ner and Sieck, 1986 | gas phase; M |
By formula: (C2H3O2- • C2H4O2) + C2H4O2 = (C2H3O2- • 2C2H4O2)
Quantity | Value | Units | Method | Reference | Comment |
---|---|---|---|---|---|
ΔrH° | 82.0 | kJ/mol | PHPMS | Meot-Ner and Sieck, 1986 | gas phase; M |
Quantity | Value | Units | Method | Reference | Comment |
ΔrS° | 120. | J/mol*K | PHPMS | Meot-Ner and Sieck, 1986 | gas phase; M |
By formula: (C2H3O2- • 2C2H4O2) + C2H4O2 = (C2H3O2- • 3C2H4O2)
Quantity | Value | Units | Method | Reference | Comment |
---|---|---|---|---|---|
ΔrH° | 67.8 | kJ/mol | PHPMS | Meot-Ner and Sieck, 1986 | gas phase; M |
Quantity | Value | Units | Method | Reference | Comment |
ΔrS° | 139. | J/mol*K | PHPMS | Meot-Ner and Sieck, 1986 | gas phase; M |
By formula: (C2H3O2- • C2H4O2 • H2O) + C2H4O2 = (C2H3O2- • 2C2H4O2 • H2O)
Quantity | Value | Units | Method | Reference | Comment |
---|---|---|---|---|---|
ΔrH° | 82.4 ± 2.1 | kJ/mol | N/A | Meot-ner, Elmore, et al., 1999 | gas phase; B |
ΔrH° | 67.8 ± 4.2 | kJ/mol | TDAs | Meot-Ner and Sieck, 1986 | gas phase; B |
Quantity | Value | Units | Method | Reference | Comment |
ΔrG° | 45.23 | kJ/mol | TDAs | Meot-ner, Elmore, et al., 1999 | gas phase; B |
ΔrG° | 26. ± 4.2 | kJ/mol | TDAs | Meot-Ner and Sieck, 1986 | gas phase; B |
By formula: (C2H3O2- • 2C2H4O2 • H2O) + C2H4O2 = (C2H3O2- • 3C2H4O2 • H2O)
Quantity | Value | Units | Method | Reference | Comment |
---|---|---|---|---|---|
ΔrH° | 52.3 ± 2.5 | kJ/mol | N/A | Meot-ner, Elmore, et al., 1999 | gas phase; B |
ΔrH° | 67.8 ± 4.2 | kJ/mol | TDAs | Meot-Ner and Sieck, 1986 | gas phase; B |
Quantity | Value | Units | Method | Reference | Comment |
ΔrG° | 24.0 | kJ/mol | TDAs | Meot-ner, Elmore, et al., 1999 | gas phase; B |
ΔrG° | 26. ± 4.2 | kJ/mol | TDAs | Meot-Ner and Sieck, 1986 | gas phase; B |
By formula: C2H3O2- + C2H6O = (C2H3O2- • C2H6O)
Quantity | Value | Units | Method | Reference | Comment |
---|---|---|---|---|---|
ΔrH° | 86.6 ± 4.2 | kJ/mol | N/A | Meot-Ner and Sieck, 1986 | gas phase; B,M |
Quantity | Value | Units | Method | Reference | Comment |
ΔrS° | 122. | J/mol*K | PHPMS | Meot-Ner and Sieck, 1986 | gas phase; M |
Quantity | Value | Units | Method | Reference | Comment |
ΔrG° | 49.8 ± 6.7 | kJ/mol | TDAs | Meot-Ner and Sieck, 1986 | gas phase; B |
By formula: C2H3O2- + C3H4N2 = (C2H3O2- • C3H4N2)
Quantity | Value | Units | Method | Reference | Comment |
---|---|---|---|---|---|
ΔrH° | 116. | kJ/mol | PHPMS | Meot-Ner (Mautner), 1988 | gas phase; M |
Quantity | Value | Units | Method | Reference | Comment |
ΔrS° | 102. | J/mol*K | PHPMS | Meot-Ner (Mautner), 1988 | gas phase; M |
By formula: C2H3O2- + C3H6O = (C2H3O2- • C3H6O)
Bond type: Hydrogen bonds of deprotonated acids to ketones/
Quantity | Value | Units | Method | Reference | Comment |
---|---|---|---|---|---|
ΔrH° | 65.7 ± 4.2 | kJ/mol | TDAs | Meot-ner, 1988 | gas phase; B,M |
Quantity | Value | Units | Method | Reference | Comment |
ΔrS° | 91.6 | J/mol*K | PHPMS | Meot-ner, 1988 | gas phase; M |
Quantity | Value | Units | Method | Reference | Comment |
ΔrG° | 38. ± 4.2 | kJ/mol | TDAs | Meot-ner, 1988 | gas phase; B |
By formula: (C2H3O2- • C3H6O) + C3H6O = (C2H3O2- • 2C3H6O)
Bond type: Hydrogen bonds of deprotonated acids to ketones/
Quantity | Value | Units | Method | Reference | Comment |
---|---|---|---|---|---|
ΔrH° | 45.2 | kJ/mol | PHPMS | Meot-ner, 1988 | gas phase; M |
Quantity | Value | Units | Method | Reference | Comment |
ΔrS° | 74.9 | J/mol*K | PHPMS | Meot-ner, 1988 | gas phase; M |
By formula: C2H3O2- + C3H7NO = (C2H3O2- • C3H7NO)
Bond type: Hydrogen bonds of deprotonated acids to amides
Quantity | Value | Units | Method | Reference | Comment |
---|---|---|---|---|---|
ΔrH° | 106. ± 4.2 | kJ/mol | TDAs | Meot-ner, 1988 | gas phase; B,M |
Quantity | Value | Units | Method | Reference | Comment |
ΔrS° | 115. | J/mol*K | PHPMS | Meot-Ner (Mautner), 1988 | gas phase; M |
Quantity | Value | Units | Method | Reference | Comment |
ΔrG° | 72.0 ± 4.2 | kJ/mol | TDAs | Meot-ner, 1988 | gas phase; B |
By formula: (C2H3O2- • C3H7NO) + C3H7NO = (C2H3O2- • 2C3H7NO)
Bond type: Hydrogen bonds of deprotonated acids to amides
Quantity | Value | Units | Method | Reference | Comment |
---|---|---|---|---|---|
ΔrH° | 73.6 | kJ/mol | PHPMS | Meot-Ner (Mautner), 1988 | gas phase; M |
Quantity | Value | Units | Method | Reference | Comment |
ΔrS° | 91.2 | J/mol*K | PHPMS | Meot-Ner (Mautner), 1988 | gas phase; M |
By formula: C2H3O2- + C4H5N = (C2H3O2- • C4H5N)
Quantity | Value | Units | Method | Reference | Comment |
---|---|---|---|---|---|
ΔrH° | 100. ± 4.2 | kJ/mol | TDAs | Meot-ner, 1988 | gas phase; B,M |
Quantity | Value | Units | Method | Reference | Comment |
ΔrS° | 105. | J/mol*K | PHPMS | Meot-ner, 1988 | gas phase; M |
Quantity | Value | Units | Method | Reference | Comment |
ΔrG° | 69.0 ± 4.2 | kJ/mol | TDAs | Meot-ner, 1988 | gas phase; B |
By formula: (C2H3O2- • C4H5N) + C4H5N = (C2H3O2- • 2C4H5N)
Quantity | Value | Units | Method | Reference | Comment |
---|---|---|---|---|---|
ΔrH° | 74.9 | kJ/mol | PHPMS | Meot-ner, 1988 | gas phase; M |
Quantity | Value | Units | Method | Reference | Comment |
ΔrS° | 101. | J/mol*K | PHPMS | Meot-ner, 1988 | gas phase; M |
By formula: C2H3O2- + C6H6O = (C2H3O2- • C6H6O)
Quantity | Value | Units | Method | Reference | Comment |
---|---|---|---|---|---|
ΔrH° | 109. ± 4.2 | kJ/mol | N/A | Meot-Ner and Sieck, 1986 | gas phase; B,M |
Quantity | Value | Units | Method | Reference | Comment |
ΔrS° | 100. | J/mol*K | PHPMS | Meot-Ner and Sieck, 1986 | gas phase; M |
Quantity | Value | Units | Method | Reference | Comment |
ΔrG° | 79.1 ± 6.7 | kJ/mol | TDAs | Meot-Ner and Sieck, 1986 | gas phase; B |
By formula: C2H3O2- + C6H11NO3 = (C2H3O2- • C6H11NO3)
Quantity | Value | Units | Method | Reference | Comment |
---|---|---|---|---|---|
ΔrH° | 126. | kJ/mol | PHPMS | Meot-Ner (Mautner), 1988 | gas phase; M |
Quantity | Value | Units | Method | Reference | Comment |
ΔrS° | 141. | J/mol*K | PHPMS | Meot-Ner (Mautner), 1988 | gas phase; M |
By formula: (C2H3O2- • C6H11NO3) + C6H11NO3 = (C2H3O2- • 2C6H11NO3)
Quantity | Value | Units | Method | Reference | Comment |
---|---|---|---|---|---|
ΔrH° | 88.7 | kJ/mol | PHPMS | Meot-Ner (Mautner), 1988 | gas phase; M |
Quantity | Value | Units | Method | Reference | Comment |
ΔrS° | 143. | J/mol*K | PHPMS | Meot-Ner (Mautner), 1988 | gas phase; M |
By formula: C2H3O2- + C6H11NO3 = (C2H3O2- • C6H11NO3)
Quantity | Value | Units | Method | Reference | Comment |
---|---|---|---|---|---|
ΔrH° | 131. ± 4.2 | kJ/mol | TDAs | Meot-ner, 1988 | gas phase; B |
Quantity | Value | Units | Method | Reference | Comment |
ΔrG° | 86.6 ± 4.2 | kJ/mol | TDAs | Meot-ner, 1988 | gas phase; B |
By formula: (C2H3O2- • C6H11NO3) + H2O = (C2H3O2- • H2O • C6H11NO3)
Bond type: Hydrogen bond (negative ion to hydride)
Quantity | Value | Units | Method | Reference | Comment |
---|---|---|---|---|---|
ΔrH° | 55.2 | kJ/mol | PHPMS | Meot-Ner (Mautner), 1988 | gas phase; M |
Quantity | Value | Units | Method | Reference | Comment |
ΔrS° | 106. | J/mol*K | PHPMS | Meot-Ner (Mautner), 1988 | gas phase; M |
By formula: C2H3O2- + C6H14O3 = (C2H3O2- • C6H14O3)
Quantity | Value | Units | Method | Reference | Comment |
---|---|---|---|---|---|
ΔrH° | 63.2 ± 4.2 | kJ/mol | N/A | Meot-Ner and Sieck, 1986 | gas phase; B,M |
Quantity | Value | Units | Method | Reference | Comment |
ΔrS° | 77.4 | J/mol*K | PHPMS | Meot-Ner and Sieck, 1986 | gas phase; M |
Quantity | Value | Units | Method | Reference | Comment |
ΔrG° | 40. ± 6.7 | kJ/mol | TDAs | Meot-Ner and Sieck, 1986 | gas phase; B |
By formula: C2H3O2- + C8H7N = (C2H3O2- • C8H7N)
Quantity | Value | Units | Method | Reference | Comment |
---|---|---|---|---|---|
ΔrH° | 117. ± 4.2 | kJ/mol | TDAs | Meot-ner, 1988 | gas phase; B,M |
Quantity | Value | Units | Method | Reference | Comment |
ΔrS° | 127. | J/mol*K | PHPMS | Meot-ner, 1988 | gas phase; M |
Quantity | Value | Units | Method | Reference | Comment |
ΔrG° | 78.7 ± 4.2 | kJ/mol | TDAs | Meot-ner, 1988 | gas phase; B |
By formula: C2H3O2- + H2O = (C2H3O2- • H2O)
Bond type: Hydrogen bond (negative ion to hydride)
Quantity | Value | Units | Method | Reference | Comment |
---|---|---|---|---|---|
ΔrH° | 68.6 ± 3.3 | kJ/mol | TDAs | Wincel, 2008 | gas phase; B |
ΔrH° | 66.5 ± 4.2 | kJ/mol | N/A | Meot-ner, Elmore, et al., 1999 | gas phase; B |
ΔrH° | 66.9 ± 4.2 | kJ/mol | N/A | Meot-Ner and Sieck, 1986 | gas phase; B,M |
ΔrH° | 68.6 ± 6.3 | kJ/mol | TDAs | Blades, Klassen, et al., 1995 | gas phase; T: 293 K. ΔSaff approx. 24 cal/mol-K; B |
ΔrH° | 66.1 | kJ/mol | PHPMS | Meot-ner, 1988 | gas phase; M |
Quantity | Value | Units | Method | Reference | Comment |
ΔrS° | 84.9 | J/mol*K | PHPMS | Meot-ner, 1988 | gas phase; M |
ΔrS° | 94.1 | J/mol*K | PHPMS | Meot-Ner and Sieck, 1986 | gas phase; ion given as C2H3COO- in paper by error; M |
Quantity | Value | Units | Method | Reference | Comment |
ΔrG° | 38. ± 5.9 | kJ/mol | N/A | Wincel, 2008 | gas phase; B |
ΔrG° | 39.8 | kJ/mol | TDAs | Meot-ner, Elmore, et al., 1999 | gas phase; B |
ΔrG° | 39. ± 6.7 | kJ/mol | TDAs | Meot-Ner and Sieck, 1986 | gas phase; B |
ΔrG° | 39.3 ± 1.3 | kJ/mol | TDAs | Blades, Klassen, et al., 1995 | gas phase; T: 293 K. ΔSaff approx. 24 cal/mol-K; B,M |
By formula: (C2H3O2- • H2O) + C2H4O2 = (C2H3O2- • C2H4O2 • H2O)
Quantity | Value | Units | Method | Reference | Comment |
---|---|---|---|---|---|
ΔrH° | 123. ± 4.2 | kJ/mol | TDAs | Meot-Ner and Sieck, 1986 | gas phase; B |
Quantity | Value | Units | Method | Reference | Comment |
ΔrG° | 85.4 ± 6.7 | kJ/mol | TDAs | Meot-Ner and Sieck, 1986 | gas phase; B |
By formula: (C2H3O2- • H2O) + C6H11NO3 = (C2H3O2- • C6H11NO3 • H2O)
Quantity | Value | Units | Method | Reference | Comment |
---|---|---|---|---|---|
ΔrH° | 115. | kJ/mol | PHPMS | Meot-Ner (Mautner), 1988 | gas phase; M |
Quantity | Value | Units | Method | Reference | Comment |
ΔrS° | 163. | J/mol*K | PHPMS | Meot-Ner (Mautner), 1988 | gas phase; M |
By formula: (C2H3O2- • H2O) + H2O = (C2H3O2- • 2H2O)
Bond type: Hydrogen bond (negative ion to hydride)
Quantity | Value | Units | Method | Reference | Comment |
---|---|---|---|---|---|
ΔrH° | 54.0 ± 4.2 | kJ/mol | N/A | Meot-ner, Elmore, et al., 1999 | gas phase; B |
ΔrH° | 57.7 ± 6.3 | kJ/mol | TDAs | Blades, Klassen, et al., 1995 | gas phase; T: 293 K. ΔSaff approx. 24 cal/mol-K; B |
ΔrH° | 53.6 | kJ/mol | PHPMS | Meot-ner, 1988 | gas phase; M |
ΔrH° | 54.0 | kJ/mol | PHPMS | Meot-Ner and Sieck, 1986 | gas phase; M |
Quantity | Value | Units | Method | Reference | Comment |
ΔrS° | 79.9 | J/mol*K | PHPMS | Meot-ner, 1988 | gas phase; M |
ΔrS° | 85.8 | J/mol*K | PHPMS | Meot-Ner and Sieck, 1986 | gas phase; M |
Quantity | Value | Units | Method | Reference | Comment |
ΔrG° | 29.3 | kJ/mol | TDAs | Meot-ner, Elmore, et al., 1999 | gas phase; B |
ΔrG° | 28.5 ± 1.3 | kJ/mol | TDAs | Blades, Klassen, et al., 1995 | gas phase; T: 293 K. ΔSaff approx. 24 cal/mol-K; B,M |
By formula: (C2H3O2- • 2H2O) + H2O = (C2H3O2- • 3H2O)
Bond type: Hydrogen bond (negative ion to hydride)
Quantity | Value | Units | Method | Reference | Comment |
---|---|---|---|---|---|
ΔrH° | 49.4 ± 4.2 | kJ/mol | N/A | Meot-ner, Elmore, et al., 1999 | gas phase; B |
ΔrH° | 51.0 ± 6.3 | kJ/mol | TDAs | Blades, Klassen, et al., 1995 | gas phase; T: 293 K. ΔSaff approx. 24 cal/mol-K; B |
ΔrH° | 49.4 | kJ/mol | PHPMS | Meot-ner, 1988 | gas phase; Entropy change calculated or estimated; M |
Quantity | Value | Units | Method | Reference | Comment |
ΔrS° | 84. | J/mol*K | N/A | Meot-ner, 1988 | gas phase; Entropy change calculated or estimated; M |
Quantity | Value | Units | Method | Reference | Comment |
ΔrG° | 24.4 | kJ/mol | TDAs | Meot-ner, Elmore, et al., 1999 | gas phase; B |
ΔrG° | 21.8 ± 1.3 | kJ/mol | TDAs | Blades, Klassen, et al., 1995 | gas phase; T: 293 K. ΔSaff approx. 24 cal/mol-K; B,M |
ΔrG° | 25. | kJ/mol | PHPMS | Meot-ner, 1988 | gas phase; Entropy change calculated or estimated; M |

References

Wincel, 2008
Wincel, H.,
Hydration energies of deprotonated amino acids from gas phase equilibria measurements,
J. Am. Soc. Mass Spectrom., 2008, 19, 8, 1091-1097, https://doi.org/10.1016/j.jasms.2008.05.014
. [all data]
Meot-ner, Elmore, et al., 1999
Meot-ner, M.; Elmore, D.E.; Scheiner, S.,
Ionic Hydrogen Bond Effects on the Acidities, Basicities, Solvation, Solvent Bridging and Self-assembly of Carboxylic Groups,
J. Am. Chem. Soc., 1999, 121, 33, 7625, https://doi.org/10.1021/ja982173i
. [all data]
Meot-Ner and Sieck, 1986
Meot-Ner, M.; Sieck, L.W.,
The ionic hydrogen bond and ion solvation. 5. OH...O- bonds. Gas phase solvation and clustering of alkoxide and carboxylate anions,
J. Am. Chem. Soc., 1986, 108, 7525. [all data]
Blades, Klassen, et al., 1995
Blades, A.T.; Klassen, J.S.; Kebarle, P.,
Free Energies of Hydration in the Gas Phase on the Anions of Some Oxo Acids of C, N, S, P, Cl and I,
J. Am. Chem. Soc., 1995, 117, 42, 10563, https://doi.org/10.1021/ja00147a019
. [all data]
Meot-ner, 1988
Meot-ner, M.,
Ionic Hydrogen Bond and Ion Solvation. 6. Interaction Energies of the Acetate Ion with Organic Molecules. Comparison of CH3COO- with Cl-, CN-, and SH-,
J. Am. Chem. Soc., 1988, 110, 12, 3854, https://doi.org/10.1021/ja00220a022
. [all data]
Angel and Ervin, 2006
Angel, L.A.; Ervin, K.M.,
Gas-phase acidities and O-H bond dissociation enthalpies of phenol, 3-methylphenol, 2,4,6-trimethylphenol, and ethanoic acid,
J. Phys. Chem. A, 2006, 110, 35, 10392-10403, https://doi.org/10.1021/jp0627426
. [all data]
Taft and Topsom, 1987
Taft, R.W.; Topsom, R.D.,
The Nature and Analysis of Substituent Effects,
Prog. Phys. Org. Chem., 1987, 16, 1. [all data]
Cumming and Kebarle, 1978
Cumming, J.B.; Kebarle, P.,
Summary of gas phase measurements involving acids AH. Entropy changes in proton transfer reactions involving negative ions. Bond dissociation energies D(A-H) and electron affinities EA(A),
Can. J. Chem., 1978, 56, 1. [all data]
Fujio, McIver, et al., 1981
Fujio, M.; McIver, R.T., Jr.; Taft, R.W.,
Effects on the acidities of phenols from specific substituent-solvent interactions. Inherent substituent parameters from gas phase acidities,
J. Am. Chem. Soc., 1981, 103, 4017. [all data]
Muftakhov, Vasil'ev, et al., 1999
Muftakhov, M.V.; Vasil'ev, Y.V.; Mazunov, V.A.,
Determination of electron affinity of carbonyl radicals by means of negative ion mass spectrometry,
Rapid Commun. Mass Spectrom., 1999, 13, 12, 1104-1108, https://doi.org/10.1002/(SICI)1097-0231(19990630)13:12<1104::AID-RCM619>3.0.CO;2-C
. [all data]
Meot-ner, Cybulski, et al., 1988
Meot-ner, M.; Cybulski, S.M.; Scheiner, S.; Liebman, J.F.,
Is CN- Significantly Anisotropic? Comparison of CN- vs. Cl-: Clustering with HCN and Condensed Phase Thermochemistry,
J. Phys. Chem., 1988, 92, 10, 2738, https://doi.org/10.1021/j100321a009
. [all data]
Meot-Ner (Mautner), 1988
Meot-Ner (Mautner), M.,
Models for Strong Interactions in Proteins and Enzymes. 2. Interactions of Ions with the Peptide Link and Imidazole,
J. Am. Chem. Soc., 1988, 110, 10, 3075, https://doi.org/10.1021/ja00218a014
. [all data]
Wenthold and Squires, 1994
Wenthold, P.G.; Squires, R.R.,
Gas-phase properties and reactivity of the acetate radical anion. Determination of the C-H bond strengths in acetic acid and acetate ion,
J. Am. Chem. Soc., 1994, 116, 26, 11890, https://doi.org/10.1021/ja00105a032
. [all data]
Wang, Woo, et al., 2006
Wang, X.B.; Woo, H.K.; Wang, L.S.; Minofar, B.; Jungwirth, P.,
Determination of the electron affinity of the acetyloxyl radical (CH3COO) by low-temperature anion photoelectron spectroscopy and ab initio calculations,
J. Phys. Chem. A, 2006, 110, 15, 5047-5050, https://doi.org/10.1021/jp060138p
. [all data]
Wang, Jagoda-Cwiklik, et al., 2009
Wang, X.B.; Jagoda-Cwiklik, B.; Chi, C.X.; Xing, X.P.; Zhou, M.F.; Jungwirth, P.; Wang, L.S.,
Microsolvation of the acetate anion [CH3CO2-(H2O)(n), n=1-3]: A photoelectron spectroscopy and ab initio computational study,
Chem. Phys. Lett., 2009, 477, 1-3, 41-44, https://doi.org/10.1016/j.cplett.2009.06.074
. [all data]
Lu and Continetti, 2004
Lu, Z.; Continetti, R.E.,
Dynamics of the acetyloxyl radical studied by dissociative photodetachment of the acetate anion,
J. Phys. Chem. A, 2004, 108, 45, 9962-9969, https://doi.org/10.1021/jp040355v
. [all data]
Ding, Wang, et al., 1998
Ding, C.F.; Wang, X.B.; Wang, L.S.,
Photoelectron spectroscopy of doubly charged anions: Intramolecular Coulomb repulsion and solvent stabilization,
J. Phys. Chem. A, 1998, 102, 45, 8633-8636, https://doi.org/10.1021/jp982698x
. [all data]
Wentworth, Chen, et al., 1968
Wentworth, W.E.; Chen, E.; Steelhammer, J.C.,
Determination of Electron Affinities of Radicals and Bond Dissociation Energies by Electron Attachment Studies at Thermal Energies - Electron Affinity of the Acetate Radical,
J. Phys. Chem., 1968, 72, 7, 2671, https://doi.org/10.1021/j100853a080
. [all data]
Tsuda and Hamill, 1964
Tsuda, S.; Hamill, W.H.,
Ionization Efficiency Measurements by the Retarding Potential Difference Method,
Adv. Mass Spectrom., 1964, 3, 249. [all data]