Octane, 2,3-dimethyl-
- Formula: C10H22
- Molecular weight: 142.2817
- IUPAC Standard InChIKey: YPMNDMUOGQJCLW-UHFFFAOYSA-N
- CAS Registry Number: 7146-60-3
- Chemical structure:
View 3d structure (requires JavaScript / HTML 5) - Other names: 2,3-Dimethyloctane

Phase change data

Data compiled as indicated in comments:
TRC - Thermodynamics Research Center, NIST Boulder Laboratories, Chris Muzny director
AC - William E. Acree, Jr., James S. Chickos
Quantity | Value | Units | Method | Reference | Comment |
---|---|---|---|---|---|
Tboil | 437.46 | K | N/A | Mears, Fookson, et al., 1950 | Uncertainty assigned by TRC = 0.15 K; TRC |
Tboil | 437.8 | K | N/A | Buck, Elsner, et al., 1949 | Uncertainty assigned by TRC = 0.5 K; TRC |
Tboil | 436.90 | K | N/A | Cline, 1939 | Uncertainty assigned by TRC = 0.5 K; TRC |
Quantity | Value | Units | Method | Reference | Comment |
ΔvapH° | 48.1 | kJ/mol | N/A | Reid, 1972 | AC |

Henry's Law data

Data compiled by: Rolf Sander
Henry's Law constant (water solution)
kH(T) = k°H exp(d(ln(kH))/d(1/T) ((1/T) - 1/(298.15 K)))
k°H = Henry's law constant for solubility in water at 298.15 K (mol/(kg*bar))
d(ln(kH))/d(1/T) = Temperature dependence constant (K)
k°H (mol/(kg*bar)) | d(ln(kH))/d(1/T) (K) | Method | Reference | Comment |
---|---|---|---|---|
0.00015 | Q | N/A | missing citation give several references for the Henry's law constants but don't assign them to specific species. |

Kovats' RI, non-polar column, isothermal

Column type | Active phase | Temperature (C) | I | Reference | Comment |
---|---|---|---|---|---|
Capillary | Squalane | 100. | 952. | Heinzen, Soares, et al., 1999 | |
Capillary | OV-101 | 40. | 954. | Laub and Purnell, 1988 | |
Capillary | OV-101 | 60. | 957. | Laub and Purnell, 1988 | |
Capillary | OV-101 | 80. | 959. | Laub and Purnell, 1988 | |
Capillary | DB-1 | 60. | 954.6 | Lubeck and Sutton, 1983 | Column length: 60. m; Column diameter: 0.264 mm |
Capillary | DB-1 | 60. | 954.6 | Lubeck and Sutton, 1983 | 60. m/0.259 mm/1. μm |
Capillary | Squalane | 86. | 955.3 | Nabivach and Kirilenko, 1979 | N2; Column length: 50. m |
Capillary | Squalane | 60. | 952.1 | Chretien and Dubois, 1976 | |
Capillary | Vacuum Grease Oil (VM-4) | 95. | 951.8 | Sultanov and Arustamova, 1975 | N2; Column length: 150. m; Column diameter: 0.25 mm |
Capillary | Squalane | 60. | 952. | Matukuma, 1969 | N2; Column length: 91.4 m; Column diameter: 0.25 mm |
Capillary | Squalane | 80. | 953. | Schomburg, 1967 | Ar; Column length: 100. m |

Kovats' RI, non-polar column, temperature ramp

Column type | Active phase | I | Reference | Comment |
---|---|---|---|---|
Capillary | OV-101 | 953. | Hayes and Pitzer, 1982 | 110. m/0.25 mm/0.20 μm, He, 1. K/min; Tstart: 35. C; Tend: 200. C |

Kovats' RI, non-polar column, custom temperature program

Column type | Active phase | I | Reference | Comment |
---|---|---|---|---|
Capillary | Petrocol DH-100 | 961.9 | Haagen-Smit Laboratory, 1997 | He; Column length: 100. m; Column diameter: 0.2 mm; Program: 5C(10min) => 5C/min => 50C(48min) => 1.5C/min => 195C(91min) |
Capillary | Squalane | 951. | Korol and Lysyuk, 1980 | Program: not specified |

Van Den Dool and Kratz RI, non-polar column, temperature ramp

Column type | Active phase | I | Reference | Comment |
---|---|---|---|---|
Capillary | Petrocol DH | 957.3 | Censullo, Jones, et al., 2003 | 50. m/0.25 mm/0.5 μm, He, 35. C @ 10. min, 3. K/min, 200. C @ 10. min |
Capillary | PONA | 953.9 | Martos, Saraullo, et al., 1997 | 50. m/0.2 mm/0.5 μm, 35. C @ 0.5 min, 1. K/min, 220. C @ 8. min |
Capillary | PONA | 958.8 | Martos, Saraullo, et al., 1997 | 50. m/0.2 mm/0.5 μm, 35. C @ 0.5 min, 1. K/min, 220. C @ 8. min |
Capillary | Petrocol DH | 955. | White, Hackett, et al., 1992 | 100. m/0.25 mm/0.5 μm, He, 1. K/min; Tstart: 30. C; Tend: 220. C |
Capillary | Cross-Linked Methylsilicone | 957. | Khorasheh, Gray, et al., 1989 | 5. K/min; Tstart: 40. C; Tend: 300. C |
Capillary | Ultra-1 | 954.65 | Haynes and Pitzer, 1985 | 50. m/0.22 mm/0.33 μm, He, 1. K/min; Tstart: -30. C; Tend: 240. C |
Capillary | Ultra-1 | 955.54 | Haynes and Pitzer, 1985 | 50. m/0.22 mm/0.33 μm, He, 2. K/min; Tstart: -30. C; Tend: 240. C |
Capillary | Ultra-1 | 955.88 | Haynes and Pitzer, 1985 | 50. m/0.22 mm/0.33 μm, He, 3. K/min; Tstart: -30. C; Tend: 240. C |
Capillary | Ultra-2 | 954.40 | Haynes and Pitzer, 1985 | 50. m/0.22 mm/0.33 μm, He, 1. K/min; Tstart: -30. C; Tend: 240. C |
Capillary | Ultra-2 | 955.21 | Haynes and Pitzer, 1985 | 50. m/0.22 mm/0.33 μm, He, 2. K/min; Tstart: -30. C; Tend: 240. C |
Capillary | Ultra-2 | 955.61 | Haynes and Pitzer, 1985 | 50. m/0.22 mm/0.33 μm, He, 3. K/min; Tstart: -30. C; Tend: 240. C |
Capillary | OV-101 | 953. | Hayes and Pitzer, 1981 | 108. m/0.25 mm/0.2 μm, 1. K/min; Tstart: 35. C; Tend: 200. C |

Normal alkane RI, non-polar column, temperature ramp

Column type | Active phase | I | Reference | Comment |
---|---|---|---|---|
Capillary | Polydimethyl siloxane: CP-Sil 5 CB | 921. | Bramston-Cook, 2013 | 60. m/0.25 mm/1.0 μm, Helium, 45. C @ 1.45 min, 3.6 K/min, 210. C @ 2.72 min |
Capillary | Petrocol DH | 959. | Supelco, 2012 | 100. m/0.25 mm/0.50 μm, Helium, 20. C @ 15. min, 15. K/min, 220. C @ 30. min |
Capillary | SE-54 | 953. | Guan, Li, et al., 1995 | 60. C @ 2. min, 4. K/min; Column length: 50. m; Column diameter: 0.32 mm; Tend: 200. C |

Normal alkane RI, non-polar column, custom temperature program

Column type | Active phase | I | Reference | Comment |
---|---|---|---|---|
Capillary | OV-101 | 952. | Du and Liang, 2003 | Program: not specified |
Capillary | Polydimethyl siloxane | 952. | Junkes, Castanho, et al., 2003 | Program: not specified |
Capillary | Squalane | 954. | Petrov, 1984 | Program: not specified |
Capillary | OV-1, SE-30, Methyl silicone, SP-2100, OV-101, DB-1, etc. | 953. | Waggott and Davies, 1984 | Hydrogen; Column length: 50. m; Column diameter: 0.32 mm; Program: not specified |

References

Mears, Fookson, et al., 1950
Mears, T.W.; Fookson, A.; Pomerantz, P.; Rich, E.H.; Dussinger, C.S.; Howard, F.L.,
Syntheses and Properties of Two Olefins, Six Paraffins, and Their Intermediates,
J. Res. Natl. Bur. Stand. (U. S.), 1950, 44, 299. [all data]
Buck, Elsner, et al., 1949
Buck, F.R.; Elsner, B.B.; Henshall, T.; Moore, T.S.; Murray, A.R.; Morrell, S.H.; Muller, G.; Plant, M.M.T.; Smith, J.C.; Wallsgrove, E.R.,
Hydrocarbon synthesis.,
J. Inst. Pet., 1949, 35, 631. [all data]
Cline, 1939
Cline, E.T.,
The Synthesis of Type III and Type V Olefins from Dimethylbutadien- monohydrobromide, Ph.D. Dissertation, Ohio State Univ., Columbus, OH, 1939. [all data]
Reid, 1972
Reid, Robert C.,
Handbook on vapor pressure and heats of vaporization of hydrocarbons and related compounds, R. C. Wilhort and B. J. Zwolinski, Texas A Research Foundation. College Station, Texas(1971). 329 pages.$10.00,
AIChE J., 1972, 18, 6, 1278-1278, https://doi.org/10.1002/aic.690180637
. [all data]