3,4-(Methylenedioxy)toluene
- Formula: C8H8O2
- Molecular weight: 136.1479
- IUPAC Standard InChIKey: GHPODDMCSOYWNE-UHFFFAOYSA-N
- CAS Registry Number: 7145-99-5
- Chemical structure:
View 3d structure (requires JavaScript / HTML 5) - Other names: 1,3-Benzodioxole, 5-methyl-; 5-methyl-1,3-benzodioxole

Phase change data

Data compiled as indicated in comments:
BS - Robert L. Brown and Stephen E. Stein
AC - William E. Acree, Jr., James S. Chickos
Quantity | Value | Units | Method | Reference | Comment |
---|---|---|---|---|---|
Tboil | 472.7 | K | N/A | Aldrich Chemical Company Inc., 1990 | BS |
Quantity | Value | Units | Method | Reference | Comment |
ΔvapH° | 54.9 ± 1.2 | kJ/mol | C | Matos, Sousa, et al., 2007 | AC |
Reduced pressure boiling point
Tboil (K) | Pressure (bar) | Reference | Comment |
---|---|---|---|
351. to 353. | 0.019 | Frinton Laboratories Inc., 1986 | BS |

References

Aldrich Chemical Company Inc., 1990
Aldrich Chemical Company Inc.,
Catalog Handbook of Fine Chemicals, Aldrich Chemical Company, Inc., Milwaukee WI, 1990, 1. [all data]
Matos, Sousa, et al., 2007
Matos, M. Agostinha R.; Sousa, Clara C.S.; Morais, Victor M.F.,
Experimental and Computational Thermochemistry of 1,3-Benzodioxole Derivatives,
J. Chem. Eng. Data, 2007, 52, 3, 1089-1094, https://doi.org/10.1021/je700035m
. [all data]
Frinton Laboratories Inc., 1986
Frinton Laboratories Inc.,
Catalog Number 11, Frinton Laboratories Inc., Vineland, NJ, 1986, 99. [all data]