1,5-Dicarbomethoxy quadricyclane
- Formula: C11H12O4
- Molecular weight: 208.2106
- IUPAC Standard InChIKey: JEAAFLQGDKNDNL-UHFFFAOYSA-N
- CAS Registry Number: 714-53-4
- Chemical structure:
View 3d structure (requires JavaScript / HTML 5) - Permanent link for this species. Use this link for bookmarking this species for future reference.

Reaction thermochemistry data

Data compiled by: Hussein Y. Afeefy, Joel F. Liebman, and Stephen E. Stein
Individual Reactions
By formula: C11H12O4 = C11H12O4
Quantity | Value | Units | Method | Reference | Comment |
---|---|---|---|---|---|
ΔrH° | -77. ± 1. | kJ/mol | Ciso | Kabakoff, Bunzli, et al., 1975 | solid phase; solvent: Toluene |

References

Kabakoff, Bunzli, et al., 1975
Kabakoff, D.S.; Bunzli, J.-C.G.; Oth, J.F.M.; Hammond, W.B.; Berson, J.A.,
Enthalpy and kinetics of isomerization of quadricyclane to norbornadiene. Strain energy of quadricyclane,
J. Am. Chem. Soc., 1975, 97, 1510-1511. [all data]